program: Gaussian 09
title: 000006714
version: EM64L-G09RevD.01
frameworkgroup: C1[X(C14H7NO7S)]
method: RPBEPBE
basis: SDD
operation: Freq
keyword: #p
keyword: freq=noraman
keyword: PBEPBE/SDD
title: #p freq=noraman PBEPBE/SDD
converged: YES YES NO NO
title: Mulliken charges:
elementType: S O O O O O O O N C C C C C C C C C C C C C C H H H H H H H
charge: 1.016100 -0.246244 -0.153056 -0.532902 -0.502295 -0.490727 -0.158162 -0.159737 0.012475 0.363668 0.312456 0.112608 0.325459 -0.281345 -0.124181 -0.178946 0.302329 -0.378251 -0.239907 -0.387051 -0.212808 -0.325816 -0.205303 0.305430 0.315102 0.304021 0.264018 0.278285 0.260833 0.403947
chargesum: 0.00000
title: Mulliken charges with hydrogens summed into heavy atoms:
elementType: S O O O O O O O N C C C C C C C C C C C C C C
charge: 1.016100 -0.246244 -0.153056 -0.128955 -0.502295 -0.490727 -0.158162 -0.159737 0.012475 0.363668 0.312456 0.112608 0.325459 -0.281345 -0.124181 -0.178946 0.302329 -0.072821 0.075195 -0.083030 0.051210 -0.047531 0.055530
polarizability: 3.14472966e+02 1.27499567e+01 2.42595884e+02 1.01583984e+00 1.33044671e+00 1.08658030e+02
1716.lowfreq: -6.4988 -3.4973 -0.0010 -0.0009 -0.0006 5.8563 20.2230 39.5032 46.3929
frequency: 20.1987 39.4816 46.3882 80.9041 88.3113 126.3082 134.2819 149.2860 160.3369 162.0859 189.8771 210.7973 227.1616 251.5366 270.1307 297.1598 314.9544 323.7444 336.7966 358.8185 379.7523 395.5044 410.4390 422.9147 454.2636 469.9521 491.4720 509.5865 567.9252 573.6476 613.6841 621.8479 647.5502 663.2047 669.8951 684.7381 711.6636 718.0155 760.9965 776.4863 800.6804 830.2324 836.6231 840.5826 869.6105 906.8303 951.4093 958.6229 963.8792 972.8527 1009.7632 1020.2282 1059.7209 1072.9176 1104.5978 1141.9113 1171.5700 1184.5484 1190.6808 1193.3666 1214.9562 1243.3593 1291.2056 1301.0097 1379.4571 1391.9122 1399.0792 1419.5461 1436.4571 1443.6392 1448.6437 1535.7904 1548.3322 1556.8258 1587.4595 1589.6169 1609.6297 3146.2902 3159.6842 3161.3288 3172.5889 3178.1488 3184.7914 3225.3851
redmass: 14.4424 9.8513 9.0247 12.1287 8.6072 10.5683 8.8720 7.1634 6.8427 9.1547 11.3225 5.0516 11.0936 6.9743 7.7916 8.0696 9.5755 7.5833 9.9021 7.7352 9.2863 6.6849 6.0762 12.2786 8.1218 5.6120 5.5288 5.8539 4.9153 7.4007 5.8149 1.3681 6.6714 7.6010 5.6493 6.5671 5.2526 4.2756 8.2041 7.9024 1.5356 4.0881 2.0412 13.0765 3.9013 6.8669 1.4201 9.3218 7.8961 1.3862 1.3810 1.3859 2.3875 2.5701 2.7660 3.7627 1.3636 1.5313 1.4219 1.3812 1.8300 6.3099 3.1030 3.3917 8.3178 13.5031 9.9244 2.9059 2.9091 3.0327 3.0048 9.1443 8.3582 7.4206 7.1076 7.7253 8.4090 1.0901 1.0881 1.0907 1.0928 1.0991 1.0999 1.0648
irintensity: 0.4145 8.0654 1.6277 1.6785 3.5406 1.9268 2.1385 4.7507 0.0955 0.4398 2.5110 0.3339 0.8942 5.2396 6.7491 1.9065 2.3066 3.6555 6.2601 8.3940 26.7803 3.4127 1.3201 49.6309 10.3360 2.2468 0.6525 1.4930 0.7492 62.1355 8.6555 253.6706 4.9447 13.5497 6.1072 10.5120 34.4414 38.9686 0.4837 5.5163 1.7607 35.8605 72.1085 75.1238 2.9182 2.4942 1.1871 57.3944 45.8335 1.9219 1.5515 1.7430 1.1819 0.5921 3.6599 15.8699 14.7037 17.0961 198.4931 52.5758 19.1693 118.4366 203.4477 348.2640 3.8513 156.1770 6.1000 9.1583 1.9874 14.1516 17.8670 20.9628 224.7757 13.8411 2.1969 2.3688 9.0240 11.0317 2.5641 4.4923 1.0296 3.8383 3.9496 213.3643
temp: 298.150 k
press: 1.00000 atm
elementType: 16 8 8 8 8 8 8 8 7 6 6 6 6 6 6 6 6 6 6 6 6 6 6 1 1 1 1 1 1 1
symmnumber: 1
zpe: 490695.4 jmol-1
zpe.correction: 0.186896 hartree
zpe.thermalcorrener: 0.206306 hartree
zpe.thermalcorrenthalpy: 0.207250 hartree
zpe.thermalcorrgfe: 0.138176 hartree
zpe.sumelectzpe: -1515.204891 hartree
zpe.sumelectthermal: -1515.185481 hartree
zpe.sumelectthermalent: -1515.184537 hartree
zpe.sumelectthermalfe: -1515.253611 hartree
dipole: -3.5194 -0.6599 -1.1366
dipole: 3.7568
quadrupole: -181.4194 -118.7762 -146.6616
quadrupole: 36.0869 -4.4822 0.8908
quadrupole: -32.4670 30.1762 2.2908 36.0869 -4.4822 0.8908
hfenergy: -1515.3917873 hartree
pointgroup: C01 [X(C14H7N1O7S1)]
dipole: 1.3889318 -0.1825276 0.4712752 debye
polarizability: 315.4185751|-9.2929612|241.3869426|4.1030945|-5.3159086|108.9213627 unknown
InChI: InChI=1S/C14H7NO7S/c16-13-8-4-2-6-10(23(20,21)22)12(8)14(17)7-3-1-5-9(11(7)13)15(18)19/h1-6,20H
charge 0 multiplicity 1
30 atoms
S  -3.997138 -0.763983 -0.371862
O  -1.455442 -2.055353 0.665326
O  1.872066 2.220003 0.450032
O  -4.077762 -1.677801 1.194714
O  -5.397436 0.02668 -0.474594
O  -3.486965 -1.709126 -1.577643
O  3.940873 1.311204 -1.389671
O  4.934765 0.805462 0.608679
N  4.017588 0.667022 -0.281887
C  -1.271362 0.298778 0.118244
C  -0.381239 1.418486 0.157809
C  1.6372 -0.153188 0.095016
C  0.754407 -1.267679 0.200104
C  -2.653086 0.579869 -0.031545
C  -0.71835 -1.069797 0.338725
C  1.103924 1.234539 0.243696
C  3.019766 -0.420888 -0.056493
C  -0.88402 2.740907 0.110298
C  -3.1636 1.884307 -0.091207
C  1.256425 -2.591838 0.188042
C  -2.266997 2.975735 0.00235
C  3.531771 -1.732407 -0.054831
C  2.640847 -2.822302 0.067974
H  -0.16623 3.565296 0.158459
H  -4.241945 2.032941 -0.21645
H  0.545352 -3.417843 0.277281
H  -2.653693 3.998566 -0.030425
H  4.60949 -1.89265 -0.153559
H  3.031806 -3.843831 0.063162
H  -3.164415 -2.120412 1.236057
