program: Gaussian 09
title: 000051955
version: EM64L-G09RevD.01
frameworkgroup: C1[X(C12H18N2O)]
method: RPBEPBE
basis: SDD
operation: Freq
keyword: #p
keyword: freq=noraman
keyword: PBEPBE/SDD
title: #p freq=noraman PBEPBE/SDD
converged: YES YES NO NO
title: Mulliken charges:
elementType: O N N C C C C C C C C C C C C H H H H H H H H H H H H H H H H H H
charge: -0.274376 -0.151874 -0.063777 0.411256 0.452213 -0.359524 -0.342543 -0.405363 -0.406555 -0.646730 -0.646780 -0.336646 -0.441000 -0.244533 -0.492553 0.234509 0.234345 0.221005 0.266799 0.234953 0.215916 0.234793 0.235611 0.235691 0.215446 0.198059 0.186669 0.213205 0.203767 0.186923 0.196155 0.230356 0.204586
chargesum: 0.00000
title: Mulliken charges with hydrogens summed into heavy atoms:
elementType: O N N C C C C C C C C C C C C
charge: -0.274376 -0.151874 -0.063777 0.411256 0.452213 -0.125016 -0.108198 -0.184357 -0.139757 0.038931 0.039967 -0.138587 -0.041126 0.146156 0.138544
polarizability: 2.73443323e+02 1.79867046e+01 1.30451030e+02 2.10765250e+01 -1.39567135e+01 1.07133778e+02
1716.lowfreq: -5.4981 -0.0006 -0.0001 0.0002 1.7851 9.7981 21.7050 28.7542 54.2402
frequency: 21.3180 28.7480 54.2035 73.4439 82.0315 90.8689 100.6194 145.4193 157.9419 196.9637 218.1403 232.7503 250.4211 258.1599 293.0960 340.4848 386.4882 394.7402 427.5762 442.0928 480.0864 511.6919 545.4691 574.3445 633.2677 721.5438 740.2704 802.0030 807.3142 827.6576 845.4783 887.1391 937.6259 942.0366 966.8258 983.9536 996.4692 1007.3517 1043.9914 1057.0404 1066.0427 1089.0502 1108.3110 1110.0341 1116.2224 1127.5691 1155.4949 1164.6383 1190.5060 1202.4525 1246.7574 1253.8472 1260.9829 1315.3715 1335.3496 1360.1184 1363.7493 1369.1112 1395.5190 1428.8995 1433.4655 1444.2219 1454.6124 1456.2720 1458.9661 1461.5848 1463.6274 1474.9609 1479.1473 1493.0747 1505.8014 1530.6437 1556.9377 1617.5324 1635.6929 2913.2342 2916.4743 2923.9251 2926.3063 2938.9862 2947.2561 2983.1520 2992.8314 3004.4417 3007.9021 3022.1360 3094.4986 3098.6792 3104.7316 3113.3735 3142.9916 3164.2229 3168.0840
redmass: 3.5641 3.6155 3.8708 2.3869 2.5086 3.7781 1.8477 2.1407 2.1412 1.1476 1.4446 3.4990 2.3448 3.0487 2.8979 3.1543 3.8904 2.8072 3.0072 3.3239 3.2890 2.6612 2.6163 3.6029 7.0651 4.5325 3.3036 2.8486 1.3531 1.6320 4.4803 2.5822 1.4026 3.0771 1.6913 1.4135 2.9114 2.1410 2.9180 1.5010 2.8406 2.5769 1.2411 1.3189 1.3737 1.4165 1.4053 1.6871 1.1562 1.1306 1.2874 1.6300 2.9299 1.4929 1.3004 1.8659 1.9618 2.3582 2.1718 1.3757 1.1368 2.3292 1.1118 1.0546 1.2184 1.0822 1.0410 1.0459 1.0696 1.0956 1.1227 2.7009 6.9970 6.2426 6.5818 1.0636 1.0473 1.0833 1.0489 1.0368 1.0393 1.1036 1.1024 1.0996 1.1025 1.0931 1.0962 1.0969 1.0941 1.0893 1.0873 1.0935 1.0944
irintensity: 1.6476 1.1352 0.8490 1.5728 6.6098 3.4860 6.2467 0.8167 8.8536 0.0773 4.3847 4.2235 1.8090 1.9439 4.6466 9.8371 5.3006 3.7725 1.4557 0.5974 5.0098 24.5205 2.8772 7.5298 0.4144 3.9887 0.1419 11.9997 17.0041 61.8369 0.9875 7.1443 3.1290 24.8775 14.9934 5.9322 0.1516 3.9161 27.2164 25.4017 58.6412 41.8049 0.0537 1.0934 5.7184 3.8314 9.0672 4.0052 87.6992 16.7197 8.4978 8.5957 29.8476 25.2188 32.2237 111.4379 67.0487 25.7870 2.1636 13.9518 1.2839 15.8848 52.6883 15.4430 7.0047 11.4237 0.1898 21.3389 4.6648 3.1806 41.4808 246.8882 36.6602 440.3674 101.8127 43.5151 69.9481 110.0443 174.9189 111.4443 107.2584 112.1411 60.4345 12.0101 79.1368 50.8601 4.4970 29.3920 48.6528 14.8063 2.8137 25.9946 13.6735
temp: 298.150 k
press: 1.00000 atm
elementType: 8 7 7 6 6 6 6 6 6 6 6 6 6 6 6 1 1 1 1 1 1 1 1 1 1 1 1 1 1 1 1 1 1
symmnumber: 1
zpe: 730301.4 jmol-1
zpe.correction: 0.278157 hartree
zpe.thermalcorrener: 0.294699 hartree
zpe.thermalcorrenthalpy: 0.295643 hartree
zpe.thermalcorrgfe: 0.231970 hartree
zpe.sumelectzpe: -651.604327 hartree
zpe.sumelectthermal: -651.587785 hartree
zpe.sumelectthermalent: -651.586841 hartree
zpe.sumelectthermalfe: -651.650514 hartree
dipole: 2.6930 0.5631 1.2479
dipole: 3.0210
quadrupole: -57.8339 -88.4840 -88.5330
quadrupole: 2.5531 -0.1167 -3.3814
quadrupole: 20.4497 -10.2004 -10.2494 2.5531 -0.1167 -3.3814
hfenergy: -651.8824842 hartree
pointgroup: C01 [X(C12H18N2O1)]
dipole: -1.0307657 0.4867849 0.3364757 debye
polarizability: 270.6194935|-25.2932596|116.5356696|-24.8400395|-16.091818|123.8729671 unknown
InChI: InChI=1S/C12H18N2O/c1-14(2)12-6-4-11(5-7-12)10-13-8-9-15-3/h4-7,10H,8-9H2,1-3H3
charge 0 multiplicity 1
33 atoms
O  4.463079 0.048346 0.792133
N  -4.02441 0.583712 0.118172
N  2.300233 -0.525176 -1.253267
C  -2.686349 0.196793 -0.001074
C  0.071905 -0.594826 -0.252157
C  -2.119426 -0.793356 0.865105
C  -1.831053 0.779696 -0.997084
C  -0.772624 -1.171683 0.733835
C  -0.490597 0.389507 -1.113064
C  -4.877779 -0.029297 1.143457
C  -4.582276 1.600423 -0.782629
C  1.475522 -1.016719 -0.362786
C  3.694073 -1.007523 -1.244559
C  4.633785 0.059201 -0.664002
C  5.156501 1.155639 1.442157
H  -2.73035 -1.265823 1.639107
H  -2.222196 1.540099 -1.679052
H  -0.362953 -1.932168 1.411694
H  0.158168 0.835709 -1.874543
H  -4.486908 0.150436 2.16588
H  -5.888554 0.404516 1.087105
H  -4.968585 -1.125862 1.002293
H  -4.057139 2.57224 -0.683083
H  -4.521776 1.288084 -1.845107
H  -5.643903 1.763039 -0.538428
H  1.803334 -1.789354 0.369221
H  3.841505 -1.942862 -0.655263
H  3.999837 -1.201862 -2.291105
H  4.371861 1.055425 -1.082861
H  5.691302 -0.173331 -0.924662
H  6.253786 1.115526 1.265292
H  4.958879 1.054518 2.521228
H  4.775509 2.137934 1.089146
