program: Gaussian 09
title: 000051946
version: EM64L-G09RevD.01
frameworkgroup: C1[X(C13H22N)]
method: RPBEPBE
basis: SDD
operation: Freq
keyword: #p
keyword: freq=noraman
keyword: PBEPBE/SDD
title: #p freq=noraman PBEPBE/SDD
converged: YES YES NO NO
title: Mulliken charges:
elementType: N C C C C C C C C C C C C C H H H H H H H H H H H H H H H H H H H H H H
charge: -0.223107 -0.301449 -0.300835 -0.334929 0.524528 -0.691985 -0.691978 -0.726676 -0.324708 -0.346773 -0.407836 -0.394411 0.432091 -0.784497 0.251408 0.254889 0.253149 0.252943 0.269241 0.270498 0.264803 0.257092 0.235522 0.264483 0.236029 0.256833 0.266838 0.243093 0.242681 0.233709 0.261820 0.259047 0.258700 0.241769 0.241329 0.256691
chargesum: 1.00000
title: Mulliken charges with hydrogens summed into heavy atoms:
elementType: N C C C C C C C C C C C C C
charge: -0.223107 0.204848 0.205256 0.204809 0.524528 0.065432 0.065367 0.025937 -0.090999 -0.084953 -0.148789 -0.135711 0.432091 -0.044709
polarizability: 1.83353821e+02 6.86043385e-01 1.10897350e+02 5.41187642e-03 -8.55189434e-01 1.31229113e+02
1716.lowfreq: -23.2874 -16.3851 -6.6981 -0.7413 -0.0009 -0.0006 -0.0002 46.9813 62.4541
frequency: -15.2952 45.3815 62.2248 77.5942 97.2233 138.8727 150.0101 190.7746 200.3121 235.5946 239.8096 295.5270 300.5241 329.8571 355.5151 360.1328 371.7091 388.4836 408.2171 431.3369 479.9243 531.2781 563.4546 622.9536 634.5267 714.2451 743.6712 764.6191 799.6794 802.8529 815.8118 834.5857 846.2097 883.8421 886.1530 957.5018 979.1706 994.6289 995.3060 1001.6146 1017.5651 1041.4672 1050.5273 1072.8583 1098.9550 1107.1144 1113.4102 1137.4349 1151.9823 1171.8329 1189.4038 1214.1961 1236.2962 1265.7452 1310.7143 1323.2549 1327.0457 1327.9016 1364.6523 1376.7498 1384.0138 1403.5102 1405.0194 1406.0988 1407.3931 1409.8964 1461.1597 1467.7851 1469.0575 1473.8061 1474.1763 1474.7642 1480.5226 1482.2047 1490.3112 1496.7522 1499.4485 1512.2914 1594.6116 1613.1249 2988.3030 3003.8423 3004.4799 3005.3736 3044.3961 3049.9929 3054.8206 3072.0801 3091.9121 3092.7758 3096.0790 3100.1958 3100.8847 3102.2823 3102.7964 3117.6464 3122.4028 3128.5865 3137.7480 3147.4547 3159.2530 3190.6394
redmass: 1.0184 3.2391 3.0472 2.4691 2.2327 1.5867 2.9140 2.0806 2.9921 1.2077 1.0473 2.7921 2.0020 3.0007 2.2451 2.5769 2.4852 3.2975 2.8593 3.5195 2.5858 3.1122 2.6233 3.4516 6.4427 3.2809 1.9918 1.3083 2.2655 1.8781 1.3063 1.2845 1.7279 1.8724 1.8942 1.3167 1.3702 1.8687 1.4066 2.9726 1.9869 3.4605 1.5962 2.0170 2.4567 2.8566 1.5118 2.3632 1.3515 1.8203 1.9767 1.1831 2.6402 1.1090 1.1276 1.2878 1.2135 1.2163 1.2985 1.8732 2.2389 1.2013 1.2060 1.2425 2.4331 1.2984 1.0675 1.0663 1.1018 1.0608 1.0528 1.0480 1.0515 1.0435 1.0538 1.2370 1.4562 1.2390 6.2294 6.1446 1.0398 1.0371 1.0373 1.0373 1.0604 1.0607 1.0609 1.0943 1.1006 1.0998 1.0971 1.1002 1.1008 1.1002 1.1005 1.1045 1.1043 1.1054 1.0881 1.0911 1.0966 1.0934
irintensity: 0.8470 0.2271 0.1935 0.0596 0.1725 1.1781 0.0454 1.3594 0.2975 0.8265 0.0336 1.3261 0.1116 0.0410 0.0809 0.2870 0.0823 1.3084 0.1231 1.2877 12.7885 0.7411 23.4827 0.0153 0.2016 3.8404 30.7091 7.4736 7.7701 4.3337 47.3257 5.4827 1.3292 11.2981 0.3478 0.6365 0.0564 32.7908 1.4742 20.7151 6.7958 15.5556 18.4515 2.6446 3.3295 0.1669 0.8059 14.0124 15.4552 0.8592 1.1876 5.1803 1.7253 0.7342 0.0070 0.0455 6.0949 4.3167 0.9792 1.9869 2.9246 51.7121 25.8604 2.3038 3.7631 22.8859 14.3087 26.0953 36.5310 15.8187 17.6847 3.4850 3.2402 1.2993 11.1830 68.9536 10.9974 15.0020 3.4105 9.1259 6.5766 4.8476 4.8858 3.9182 2.8485 19.8756 4.3733 11.0988 0.1089 0.4378 22.5953 6.3963 1.4340 2.9198 9.5377 1.5896 47.0672 12.6497 5.2317 5.3154 4.1299 2.2163
temp: 298.150 k
press: 1.00000 atm
elementType: 7 6 6 6 6 6 6 6 6 6 6 6 6 6 1 1 1 1 1 1 1 1 1 1 1 1 1 1 1 1 1 1 1 1 1 1
symmnumber: 1
zpe: 847854.1 jmol-1
zpe.correction: 0.322931 hartree
zpe.thermalcorrener: 0.337930 hartree
zpe.thermalcorrenthalpy: 0.338874 hartree
zpe.thermalcorrgfe: 0.281646 hartree
zpe.sumelectzpe: -561.996192 hartree
zpe.sumelectthermal: -561.981193 hartree
zpe.sumelectthermalent: -561.980249 hartree
zpe.sumelectthermalfe: -562.037477 hartree
dipole: -3.3370 0.0800 -0.4593
dipole: 3.3694
quadrupole: -49.8964 -77.0083 -71.3033
quadrupole: 0.3672 0.0714 -0.2350
quadrupole: 16.1730 -10.9390 -5.2340 0.3672 0.0714 -0.2350
hfenergy: -562.3191226 hartree
pointgroup: C01 [X(C13H22N1)]
dipole: 1.313185 0.0077792 0.1809311 debye
polarizability: 183.3324256|-1.4184925|110.8875053|-0.0872747|-0.3107757|131.2603525 unknown
InChI: InChI=1S/C13H22N/c1-5-14(6-2,7-3)13-10-8-12(4)9-11-13/h8-11H,5-7H2,1-4H3
charge 1 multiplicity 1
36 atoms
N  1.381618 -0.021671 0.189561
C  1.801636 -1.314598 0.959167
C  1.824178 1.196707 1.0600
C  2.095815 0.028591 -1.185814
C  -0.140717 -0.00302 0.027991
C  1.479593 -2.61867 0.226351
C  1.50625 2.560899 0.444746
C  3.627368 0.031505 -1.129983
C  -0.937692 -0.025437 1.196341
C  -0.758177 0.030818 -1.240058
C  -2.342374 -0.011775 1.089245
C  -2.168225 0.04372 -1.329107
C  -2.989365 0.026865 -0.174521
C  -4.499314 0.070022 -0.281584
H  2.880971 -1.216759 1.160575
H  1.273215 -1.271074 1.924753
H  1.309063 1.07674 2.026284
H  2.904634 1.071111 1.238233
H  1.735799 -0.845511 -1.749706
H  1.729106 0.93623 -1.689264
H  1.705167 -3.457553 0.907984
H  0.412429 -2.689634 -0.042433
H  2.091416 -2.766474 -0.679186
H  1.7487 3.337125 1.191699
H  2.106904 2.780906 -0.453828
H  0.436563 2.664174 0.196944
H  3.993478 0.058334 -2.171708
H  4.044555 0.918046 -0.624171
H  4.049928 -0.876367 -0.668332
H  -0.496214 -0.056045 2.198077
H  -0.187702 0.044399 -2.170352
H  -2.944142 -0.031974 2.004219
H  -2.633189 0.067081 -2.320656
H  -4.855161 -0.391447 -1.218009
H  -4.983478 -0.448438 0.563086
H  -4.861436 1.115971 -0.273943
