program: Gaussian 09
title: 000051905
version: EM64L-G09RevD.01
frameworkgroup: C1[X(C10H11NO3)]
method: RPBEPBE
basis: SDD
operation: Freq
keyword: #p
keyword: freq=noraman
keyword: PBEPBE/SDD
title: #p freq=noraman PBEPBE/SDD
converged: YES YES NO NO
title: Mulliken charges:
elementType: O O O N C C C C C C C C C C H H H H H H H H H H H
charge: -0.304510 -0.442444 -0.274170 -0.463489 0.524177 -0.578109 -0.395102 0.348581 -0.166067 -0.427184 0.271736 -0.360587 -0.029328 -0.550596 0.249782 0.300207 0.334538 0.225652 0.221901 0.223065 0.242266 0.253706 0.355754 0.222675 0.217548
chargesum: 0.00000
title: Mulliken charges with hydrogens summed into heavy atoms:
elementType: O O O N C C C C C C C C C C
charge: -0.304510 -0.086690 -0.274170 -0.128951 0.524177 -0.328327 -0.094895 0.348581 0.059585 -0.205283 0.271736 0.104743 0.224378 -0.110373
polarizability: 2.10752658e+02 -7.60752126e+00 1.17378468e+02 -1.81314065e+00 2.87750178e+00 6.83905062e+01
1716.lowfreq: -10.4771 -2.4921 0.0006 0.0006 0.0009 6.8983 29.4037 35.3078 67.7881
frequency: 29.2675 35.0680 67.7865 77.4122 108.4104 128.0683 226.4448 239.3026 251.0455 276.3860 306.0879 342.7268 351.9103 425.6344 445.6212 453.7564 515.6429 594.4703 597.2524 650.7878 664.9093 672.3434 686.7205 701.5594 763.5336 773.6938 864.0692 877.3686 879.4581 907.5453 933.5426 959.2848 965.1556 974.7114 981.3329 1011.2023 1023.1179 1090.7576 1141.8637 1149.9085 1164.6488 1177.5324 1209.3699 1252.9686 1281.6780 1284.8055 1319.1482 1343.2007 1392.1737 1427.2928 1447.3522 1450.1385 1486.0954 1530.3630 1602.0909 1635.2992 1660.7085 1666.6045 3018.0717 3089.5987 3106.0638 3122.5148 3128.1589 3147.4964 3152.0216 3198.7549 3199.8834 3542.6779 3589.1534
redmass: 4.1021 4.6918 9.1345 3.4011 3.0626 4.0812 4.7566 4.4914 4.5834 5.9249 6.4077 2.3956 1.1049 4.0084 2.3584 2.9578 6.8849 3.0669 3.0240 1.6699 5.0513 2.5777 2.0071 4.5465 5.5623 1.4171 1.6651 3.7916 1.4230 3.4796 1.8846 1.5476 1.7087 1.3020 6.0351 2.1125 1.7254 1.6071 1.3977 2.5332 2.1975 1.1519 1.5159 1.1389 2.2278 1.2542 1.6649 1.2128 6.7849 1.1607 1.5179 1.5734 2.8167 2.3902 5.4128 6.2116 4.6304 8.4095 1.0608 1.0610 1.1016 1.0885 1.0968 1.0924 1.0946 1.0949 1.1143 1.0761 1.0660
irintensity: 0.0865 0.8908 5.3270 0.2575 0.5889 3.3333 1.2505 5.7924 8.1333 9.6612 10.1966 3.7413 147.5857 10.1297 6.9911 6.3019 1.4684 3.3642 7.7951 38.9354 9.0609 3.5554 38.0421 57.1028 2.6080 50.9020 47.8601 2.3468 17.8712 169.2228 86.8482 36.4912 44.4162 4.0824 7.8992 166.3680 59.4250 30.6319 171.0219 351.6460 80.1025 46.9587 24.7478 13.8587 74.9040 14.6350 43.8304 5.6037 131.6084 13.6288 9.4944 124.7271 135.2023 377.9919 97.6014 252.9088 3.1090 196.6032 32.1117 9.3933 7.7788 11.9399 6.8676 11.8303 10.8035 5.7140 22.4530 32.1257 41.1824
temp: 298.150 k
press: 1.00000 atm
elementType: 8 8 8 7 6 6 6 6 6 6 6 6 6 6 1 1 1 1 1 1 1 1 1 1 1
symmnumber: 1
zpe: 507043.3 jmol-1
zpe.correction: 0.193123 hartree
zpe.thermalcorrener: 0.206659 hartree
zpe.thermalcorrenthalpy: 0.207603 hartree
zpe.thermalcorrgfe: 0.151294 hartree
zpe.sumelectzpe: -667.046163 hartree
zpe.sumelectthermal: -667.032626 hartree
zpe.sumelectthermalent: -667.031682 hartree
zpe.sumelectthermalfe: -667.087991 hartree
dipole: -0.5844 -0.8116 0.1942
dipole: 1.0188
quadrupole: -56.3999 -83.5903 -83.5075
quadrupole: -8.1342 -2.4689 2.2112
quadrupole: 18.0993 -9.0910 -9.0083 -8.1342 -2.4689 2.2112
hfenergy: -667.2392854 hartree
pointgroup: C01 [X(C10H11N1O3)]
dipole: -0.2225022 0.3292534 0.0524307 debye
dipolederiv: -2.1163427 -0.2146076 -0.1281441 -0.4043856 -0.4734451 -0.1430457 -0.444898 -0.0637532 -0.4779052 -0.9320858 0.5815075 0.2198308 0.7304549 -0.7070111 -0.0182709 0.2798249 -0.0337754 -0.399871 -0.8791498 0.0531668 -0.0141581 0.2585723 -0.8295691 -0.1733022 0.0444244 -0.2358233 -0.4245604 -2.2070553 0.1097105 -0.1546846 0.4124013 -0.3663714 0.0364141 -0.1265492 -0.0012948 -0.3378152 1.4886802 0.011688 0.1957907 0.3973223 0.2396639 0.1102678 0.4461698 0.0622882 0.2132491 -0.6521795 0.1672654 0.0323988 0.0904266 -0.0945459 0.0921582 -0.0291887 0.105692 -0.1909802 -0.4212932 -0.0461578 -0.0455604 -0.2764447 -0.2150155 -0.0397635 -0.1777627 -0.0084294 -0.2408277 1.0593372 -0.5201701 -0.1083688 -0.6854317 0.6491182 0.1616534 -0.172158 0.1814467 0.1657438 0.3383982 -0.0063958 0.0713425 -0.0560819 0.1251487 0.106578 0.0538226 0.1170914 -0.0421313 -0.2511717 0.0046839 0.0130228 0.2875871 -0.3478035 -0.0008033 0.1453406 -0.0484729 -0.2477508 2.9691602 -0.0486549 0.2235794 -0.3396283 1.1526475 0.30121 0.3061505 0.4146176 0.4954638 1.1542495 0.0358388 -0.0345411 -0.3221842 0.2508304 -0.0171833 -0.145439 -0.0838828 0.3183785 -0.1342593 0.131172 -0.0038704 0.1718141 -0.1412944 0.078482 -0.0381663 0.02488 0.0432822 -0.2142823 0.1363352 0.0225101 0.1593484 -0.266231 0.0580809 0.0882785 0.0780921 0.1094324 0.0833165 -0.0490977 -0.0456874 -0.0420002 0.0061389 -0.0981002 -0.0402892 -0.1001321 0.1286465 0.1405424 0.0609258 0.015765 0.0561059 0.0937692 -0.0426167 0.0177824 -0.0386392 0.1703193 0.1942096 0.0441841 -0.010651 -0.0014072 0.1907195 -0.0591654 -0.0255696 -0.0594215 0.2917967 0.0675696 -0.0298759 -0.0290317 -0.046939 -0.0458318 -0.1060691 -0.0387711 -0.1047185 0.0908967 -0.1361309 -0.0078971 -0.0602698 0.0113688 0.1005553 -0.041549 -0.0529319 -0.0448438 0.153609 -0.0666844 -0.0252564 -0.081506 -0.0457779 0.0793726 -0.094248 -0.0421381 -0.0335907 -0.0397583 -0.0086227 -0.071919 0.0484739 0.0918199 -0.0588471 0.0605615 0.0977908 0.0255488 0.0671404 0.1161021 -0.0668357 -0.0706936 -0.0938039 0.1006547 -0.0454994 -0.0368857 -0.022757 -0.0397311 0.2572348 -0.1152335 -0.0848642 -0.1816963 0.274952 -0.0874181 -0.1163053 -0.0773107 0.3255385 0.0674901 -0.0639914 0.0741303 -0.0952038 0.1490642 0.0128457 0.0984325 0.0233087 -0.0695208 0.0829671 -0.0703852 -0.0448128 -0.0762367 0.1333308 -0.051217 -0.0909641 -0.0761202 -0.0626449 unknown
polarizability: 210.67898|2.979785|107.1521708|8.4679851|19.8739607|78.6904812 unknown
InChI: InChI=1S/C10H11NO3/c1-2-6-14-10(13)11-8-4-3-5-9(12)7-8/h2-5,7,11-12H,1,6H2
charge 0 multiplicity 1
25 atoms
O  2.428244 0.38333 1.018601
O  -4.41358 1.688614 0.421922
O  1.505776 -1.472644 -0.110529
N  0.211873 0.387513 0.604584
C  -1.105913 0.048312 0.193015
C  -2.128317 0.986293 0.482098
C  -1.413893 -1.165928 -0.478716
C  -3.455687 0.709543 0.10011
C  -2.751552 -1.414603 -0.848808
C  -3.784974 -0.493408 -0.570017
C  1.371095 -0.350913 0.439233
C  3.778728 -0.255712 0.911062
C  4.424153 0.049689 -0.416614
C  5.571612 0.759667 -0.548943
H  -1.914962 1.92864 0.998245
H  -0.621597 -1.883218 -0.69738
H  0.3400 1.282114 1.082779
H  -2.993858 -2.349078 -1.366562
H  -4.819629 -0.705969 -0.86653
H  4.34291 0.174116 1.753236
H  3.64781 -1.345247 1.046215
H  3.917257 -0.362661 -1.299107
H  -5.312075 1.41178 0.114968
H  6.025885 0.938146 -1.529754
H  6.094393 1.178323 0.32049
