program: Gaussian 09
title: 000051903
version: EM64L-G09RevD.01
frameworkgroup: C1[X(C12H17NO3)]
method: RPBEPBE
basis: SDD
operation: Freq
keyword: #p
keyword: freq=noraman
keyword: PBEPBE/SDD
title: #p freq=noraman PBEPBE/SDD
converged: YES YES NO NO
title: Mulliken charges:
elementType: O O O N C C C C C C C C C C C C H H H H H H H H H H H H H H H H H
charge: -0.326961 -0.265849 -0.281120 -0.459504 0.048476 0.481469 -0.685560 -0.681169 0.341275 -0.461047 -0.336045 -0.329712 -0.368064 0.254539 -0.243484 -0.685075 0.234124 0.208589 0.232092 0.220409 0.210723 0.254345 0.216429 0.219749 0.301148 0.325766 0.244570 0.249052 0.205445 0.205042 0.205615 0.232394 0.232340
chargesum: 0.00000
title: Mulliken charges with hydrogens summed into heavy atoms:
elementType: O O O N C C C C C C C C C C C C
charge: -0.326961 -0.265849 -0.281120 -0.133738 0.282600 0.481469 -0.024470 0.000328 0.341275 -0.241298 -0.034897 -0.085142 -0.119012 0.254539 0.167003 -0.014725
polarizability: 2.57818817e+02 -2.30243458e+00 1.35709109e+02 -1.93233448e+00 5.85081708e+00 8.86375822e+01
1716.lowfreq: -7.0888 -0.0011 -0.0009 -0.0008 2.6712 8.8939 28.6855 39.4199 58.0472
frequency: 28.5163 39.1030 58.0385 69.3837 76.4166 99.2528 114.4573 138.5018 184.0640 190.4049 193.5356 225.3728 240.5323 247.6327 304.8622 350.3468 369.0397 377.8582 398.4820 414.0998 425.9610 460.0159 521.9070 576.5939 625.9256 634.1137 694.9351 708.1483 718.5482 732.8703 791.3944 798.2060 831.7227 848.6269 858.7609 900.2166 903.6683 918.1165 925.1429 940.9207 979.3893 985.8544 1003.6853 1039.3517 1104.4355 1115.9227 1126.0407 1137.1252 1155.1592 1160.0037 1183.7098 1187.0974 1217.7288 1263.1445 1266.5223 1308.0558 1325.1425 1339.7293 1363.1952 1378.6621 1379.5466 1396.6198 1400.2618 1426.3786 1456.3955 1460.4415 1464.5085 1472.3490 1477.6535 1487.4424 1487.9444 1498.2648 1516.2914 1592.2057 1633.5719 1656.0560 2948.3865 2987.8270 2992.3902 2997.1831 3004.8325 3027.0926 3083.2706 3093.0397 3094.3213 3097.7670 3103.1298 3106.2009 3116.2564 3160.0522 3167.4588 3190.0366 3544.8148
redmass: 4.0091 2.8636 4.3220 4.2582 4.8396 5.1372 1.7405 3.6646 5.4277 1.0748 3.3290 1.6848 1.2174 1.9216 3.7119 4.1885 5.8059 4.1171 3.1437 3.0632 3.4518 2.8752 2.3853 5.5813 6.9974 1.2689 6.3184 6.6366 3.6624 4.2305 4.3840 1.3505 1.1099 1.4897 4.3006 2.8622 3.2414 1.3788 1.2436 1.3500 1.3090 6.9102 2.8398 2.8593 1.8485 2.1478 1.3226 1.4413 2.3962 2.4143 1.3644 1.7900 2.4246 1.1446 2.4489 1.3488 1.4284 1.3127 1.8356 1.2632 2.4217 1.2352 1.3070 3.9541 1.0545 1.0399 1.0479 1.0509 1.0755 1.0719 1.1922 1.7208 2.5801 5.6346 6.4095 8.5147 1.0553 1.0355 1.0359 1.0362 1.1073 1.0865 1.0994 1.0987 1.0989 1.1006 1.1006 1.1013 1.0897 1.0901 1.0931 1.0955 1.0759
irintensity: 1.1691 0.3443 0.2356 0.9891 3.6880 2.7627 3.4036 0.1303 0.0252 0.2642 5.2933 3.1660 0.8343 8.5133 3.4766 1.4765 2.0400 4.3292 8.6081 0.0361 1.1997 0.9737 30.2277 10.6395 1.8055 45.3477 39.2745 19.7727 0.1185 17.3046 1.9331 51.7209 0.2260 65.1378 0.6968 1.6602 58.6628 1.8300 2.9775 0.5189 1.2973 255.5023 46.6357 78.4491 283.7621 0.3612 27.9391 4.3782 208.0436 315.6978 17.9340 1.6656 216.0144 0.4023 29.3410 10.0473 12.2553 12.4884 11.2392 34.4385 110.3318 26.2924 60.9305 14.3596 5.9362 11.6967 5.8320 5.6510 39.4152 15.1724 46.1471 21.6227 691.3481 50.1091 0.3605 268.6679 45.9290 17.1033 28.5685 28.4133 41.2318 6.7268 7.0497 61.0908 29.7931 19.8049 34.5689 35.0622 22.2619 4.7887 13.6909 4.9904 27.3249
temp: 298.150 k
press: 1.00000 atm
elementType: 8 8 8 7 6 6 6 6 6 6 6 6 6 6 6 6 1 1 1 1 1 1 1 1 1 1 1 1 1 1 1 1 1
symmnumber: 1
zpe: 712350.1 jmol-1
zpe.correction: 0.271320 hartree
zpe.thermalcorrener: 0.288431 hartree
zpe.thermalcorrenthalpy: 0.289375 hartree
zpe.thermalcorrgfe: 0.225328 hartree
zpe.sumelectzpe: -746.695043 hartree
zpe.sumelectthermal: -746.677932 hartree
zpe.sumelectthermalent: -746.676988 hartree
zpe.sumelectthermalfe: -746.741036 hartree
dipole: -0.2182 3.4020 0.7242
dipole: 3.4851
quadrupole: -69.4391 -93.2062 -98.3191
quadrupole: -4.5529 -0.8736 0.6016
quadrupole: 17.5491 -6.2181 -11.3310 -4.5529 -0.8736 0.6016
hfenergy: -746.9663633 hartree
pointgroup: C01 [X(C12H17N1O3)]
dipole: 0.0877337 1.3457788 -0.2473543 debye
polarizability: 257.8358107|2.4954076|135.9962903|0.0904236|-4.5333404|88.3334067 unknown
InChI: InChI=1S/C12H17NO3/c1-4-15-11-7-5-10(6-8-11)13-12(14)16-9(2)3/h5-9,13H,4H2,1-3H3
charge 0 multiplicity 1
33 atoms
O  -3.500692 0.578815 -0.193091
O  4.282318 -0.581263 -0.116552
O  -2.310168 -1.44617 0.06916
N  -1.246493 0.653174 -0.232197
C  -4.798704 -0.176385 -0.127399
C  0.13806 0.320796 -0.198613
C  -5.827156 0.834165 0.38594
C  -5.119962 -0.743582 -1.51787
C  2.928429 -0.205461 -0.15491
C  1.073783 1.37285 -0.353224
C  0.611389 -1.008573 -0.02009
C  2.462138 1.120552 -0.333312
C  1.994039 -1.259004 0.000337
C  -2.328691 -0.199729 -0.104035
C  5.291821 0.480395 -0.281772
C  6.65953 -0.192562 -0.199402
H  -4.654428 -1.004118 0.591905
H  -6.814233 0.347516 0.485826
H  -5.530389 1.229477 1.372369
H  -5.926303 1.681096 -0.315932
H  -6.085731 -1.281203 -1.493345
H  -4.33909 -1.454175 -1.836907
H  -5.193188 0.070481 -2.26096
H  0.720398 2.402818 -0.490942
H  -0.104974 -1.823791 0.099403
H  -1.490766 1.636487 -0.366661
H  3.156018 1.956844 -0.456389
H  2.372968 -2.276573 0.136784
H  5.147652 0.979471 -1.262935
H  5.168353 1.238343 0.520145
H  7.461413 0.559103 -0.316335
H  6.78759 -0.693535 0.775228
H  6.76907 -0.949157 -0.994924
