program: Gaussian 09
title: 000051910
version: EM64L-G09RevD.01
frameworkgroup: C1[X(C13H12N2O2S)]
method: RPBEPBE
basis: SDD
operation: Freq
keyword: #p
keyword: freq=noraman
keyword: PBEPBE/SDD
title: #p freq=noraman PBEPBE/SDD
converged: YES YES NO NO
title: Mulliken charges:
elementType: S O O N N C C C C C C C C C C C C C H H H H H H H H H H H H
charge: 0.312286 -0.302900 -0.266820 -0.453004 0.020434 0.448850 0.481800 -0.373713 -0.371690 -0.441767 -0.352515 -0.807464 0.266518 -0.379679 0.110012 -0.706064 0.029063 -0.367523 0.232441 0.231547 0.222474 0.295565 0.226992 0.223453 0.236489 0.333431 0.253030 0.271458 0.315153 0.312143
chargesum: 0.00000
title: Mulliken charges with hydrogens summed into heavy atoms:
elementType: S O O N N C C C C C C C C C C C C C
charge: 0.312286 -0.302900 -0.266820 -0.119573 0.020434 0.448850 0.481800 -0.141272 -0.140143 -0.219293 -0.056949 -0.120530 0.266518 0.144809 0.110012 -0.078768 0.029063 -0.367523
polarizability: 2.81250227e+02 2.39746492e-01 1.44151798e+02 -1.60183716e-01 2.82292855e+00 1.44803001e+02
1716.lowfreq: -28.3145 -3.9633 -1.9638 -0.0014 -0.0010 -0.0007 6.8024 9.1198 13.8539
frequency: -28.0739 7.0043 13.7439 20.6813 33.5051 55.0061 58.7217 71.6207 113.0171 127.5030 146.4692 176.1959 239.8534 262.8925 270.2747 309.3046 337.6799 341.9423 377.5102 379.9373 388.9369 409.1710 416.5641 492.9112 513.5135 571.7546 607.7348 627.6093 645.2769 656.0028 662.1068 695.3358 715.2964 759.9674 777.2576 821.9378 835.1785 850.7953 872.8173 887.0788 944.8298 971.6814 982.6197 989.3049 1000.5638 1011.1491 1047.1668 1130.1791 1139.9379 1152.5632 1190.4362 1195.5998 1224.4717 1236.2573 1249.2017 1258.6431 1315.8882 1344.0968 1373.0293 1399.1639 1413.9939 1431.5591 1435.0085 1470.0030 1473.9838 1502.5551 1520.5707 1597.8678 1630.2675 1680.5661 2096.6852 2277.1036 2974.5126 3011.5495 3039.2903 3055.2881 3084.6336 3084.9282 3111.4232 3114.3746 3127.5750 3138.9270 3186.5442 3540.3104
redmass: 1.0186 6.0898 5.6934 11.8319 4.5800 6.3138 8.1681 5.6058 5.2660 6.4014 4.7367 4.4760 6.6942 2.8644 5.9335 4.7261 3.8148 3.9613 3.9806 11.5439 6.3103 2.9444 10.0188 7.3507 2.5017 5.7505 10.6146 6.7514 1.4501 9.4995 5.8802 4.4731 3.0371 4.7201 4.6072 1.4646 5.7993 1.2826 1.4527 6.8977 1.3423 4.1778 1.3363 1.4115 2.6876 2.9058 1.5474 1.3247 1.0901 3.4294 3.1622 1.1140 2.5582 1.3243 1.0862 2.3455 1.3491 1.2802 4.9884 1.2242 3.4633 1.0980 1.1135 1.1229 1.0602 1.9150 2.8033 4.9036 6.3856 9.1012 12.7175 11.7241 1.0389 1.0595 1.0560 1.0948 1.0997 1.1018 1.0878 1.1090 1.0908 1.0964 1.0943 1.0761
irintensity: 0.6478 0.8282 1.1390 0.3885 3.7235 0.5889 2.0188 3.8550 1.2722 4.6119 4.7782 6.0740 4.7464 11.3190 5.0093 9.0531 18.0896 9.7693 1.2439 0.0467 18.1858 0.0269 5.1558 9.0650 34.9922 5.8649 24.8650 8.3244 28.7213 17.9686 18.1890 50.1582 0.0830 2.8229 4.1993 68.3361 10.1323 19.0047 1.9121 13.4565 4.4717 276.5241 2.9166 0.4172 213.5704 27.4941 17.3753 53.2365 0.2355 351.4652 28.4107 4.1441 0.5169 93.2872 3.4050 7.6832 25.8461 38.4678 77.9177 5.1666 37.5691 38.3117 5.9190 55.8669 19.8951 66.5107 532.0914 38.4255 29.2962 291.2605 32.0005 10.8567 42.6440 28.0853 2.6375 23.7653 18.3214 2.5781 17.9427 0.2953 22.3983 16.4655 2.2069 33.6777
temp: 298.150 k
press: 1.00000 atm
elementType: 16 8 8 7 7 6 6 6 6 6 6 6 6 6 6 6 6 6 1 1 1 1 1 1 1 1 1 1 1 1
symmnumber: 1
zpe: 578432.8 jmol-1
zpe.correction: 0.220313 hartree
zpe.thermalcorrener: 0.238532 hartree
zpe.thermalcorrenthalpy: 0.239476 hartree
zpe.thermalcorrgfe: 0.167687 hartree
zpe.sumelectzpe: -1159.229432 hartree
zpe.sumelectthermal: -1159.211214 hartree
zpe.sumelectthermalent: -1159.210270 hartree
zpe.sumelectthermalfe: -1159.282058 hartree
dipole: 4.4626 1.8437 1.4563
dipole: 5.0434
quadrupole: -136.6589 -114.8225 -106.5951
quadrupole: -25.5651 3.2584 0.7213
quadrupole: -17.3000 4.5363 12.7637 -25.5651 3.2584 0.7213
hfenergy: -1159.4497457 hartree
pointgroup: C01 [X(C13H12N2O2S1)]
dipole: -1.6960604 0.0388217 -1.0290548 debye
polarizability: 280.7354151|0.5238289|141.7199617|8.276399|0.7135194|147.7496493 unknown
InChI: InChI=1S/C13H12N2O2S/c1-11-4-6-12(7-5-11)15-13(16)17-8-2-3-9-18-10-14/h4-7,15H,8-9H2,1H3
charge 0 multiplicity 1
30 atoms
S  5.792237 -0.813119 0.239543
O  0.555988 0.627809 -1.871322
O  -0.653456 1.942129 -0.318688
N  -1.463378 -0.115469 -1.184165
N  7.534736 -1.268792 2.564401
C  -5.325422 -0.660881 0.587843
C  -2.743814 -0.252332 -0.571351
C  -4.776113 -1.600101 -0.322155
C  -4.550407 0.486835 0.893965
C  -3.504012 -1.405058 -0.895909
C  -3.274799 0.703058 0.332422
C  -6.682587 -0.887976 1.230347
C  -0.56195 0.914198 -1.032136
C  1.682411 1.588864 -1.745968
C  2.673617 1.153329 -0.755751
C  4.488804 0.396596 1.070625
C  3.514937 0.805748 0.077825
C  6.81143 -1.070429 1.627556
H  -5.349878 -2.49621 -0.587105
H  -4.951737 1.234055 1.58955
H  -3.103578 -2.146899 -1.598885
H  -2.695744 1.594411 0.582799
H  -7.218827 0.064152 1.391218
H  -7.322609 -1.538018 0.608297
H  -6.580139 -1.375977 2.21934
H  -1.164362 -0.861459 -1.816479
H  2.123876 1.632172 -2.755346
H  1.276087 2.579703 -1.468323
H  4.033876 -0.171832 1.897097
H  5.074412 1.241994 1.465056
