program: Gaussian 09
title: 000051989
version: EM64L-G09RevD.01
frameworkgroup: C1[X(C26H26ClN3O3)]
method: RPBEPBE
basis: SDD
operation: Freq
keyword: #p
keyword: freq=noraman
keyword: PBEPBE/SDD
title: #p freq=noraman PBEPBE/SDD
converged: YES YES NO NO
title: Mulliken charges:
elementType: Cl O O O N N N C C C C C C C C C C C C C C C C C C C C C C C C C C H H H H H H H H H H H H H H H H H H H H H H H H H H
charge: -0.053428 -0.442947 -0.373663 -0.259761 -0.095471 -0.250497 -0.079236 -0.370923 -0.355853 -0.398668 -0.391531 -0.398433 -0.456680 0.334163 -0.541238 0.068061 0.229863 -0.067390 0.210297 0.225246 -0.373351 0.216136 -0.348548 0.206354 -0.504319 -0.277573 -0.388302 -0.355169 0.325366 -0.352840 -0.303517 -0.096349 -0.537282 0.175614 0.237148 0.208926 0.164302 0.190893 0.208351 0.204223 0.188434 0.211782 0.187659 0.225241 0.222519 0.297482 0.214296 0.250942 0.308327 0.280610 0.265724 0.295800 0.353143 0.245928 0.261067 0.373749 0.219483 0.247587 0.218254
chargesum: 0.00000
title: Mulliken charges with hydrogens summed into heavy atoms:
elementType: Cl O O O N N N C C C C C C C C C C C C C C C C C C C C C C C C C C
charge: -0.053428 -0.089804 0.000086 -0.259761 -0.095471 -0.250497 -0.079236 0.041839 0.017376 0.000576 0.001126 0.001008 -0.008921 0.334163 -0.243755 0.068061 0.229863 -0.067390 0.210297 0.225246 -0.159055 0.216136 -0.097606 0.206354 -0.195992 0.003037 -0.122578 -0.059369 0.325366 -0.106912 -0.042450 -0.096349 0.148042
polarizability: 4.60511862e+02 -2.73223158e+01 4.49389564e+02 2.53256787e+01 -1.39768402e+00 2.16999277e+02
1716.lowfreq: -19.4145 -6.1031 -2.1162 -0.0009 0.0004 0.0005 5.9473 18.5781 24.5962
frequency: -15.0891 18.4907 24.4784 26.4555 40.8845 44.8531 53.5506 81.2570 86.5749 99.9031 112.2147 123.4140 136.0417 141.9026 174.2662 182.6729 201.5625 212.3735 214.0008 219.7798 243.8773 248.3719 252.7064 274.4500 285.6817 296.4079 303.4273 312.4567 326.3462 337.6523 348.1596 367.9333 383.2805 386.8215 393.2460 412.9413 429.0690 431.6466 441.9821 447.1597 460.5125 478.0447 497.9611 512.6511 528.2537 558.2791 569.3120 575.7152 578.8236 584.8471 601.3626 636.7342 653.8394 658.5135 673.0543 709.8564 716.6716 731.8658 736.3662 753.8432 761.1623 780.7828 790.8990 805.1620 807.9306 815.1047 824.3783 852.5535 856.5393 869.6299 893.3201 905.9329 921.2333 925.6656 932.0818 937.9325 944.3209 947.3653 956.8299 959.4714 986.8557 988.6851 996.5798 1008.4958 1045.3066 1061.6589 1080.5250 1082.1069 1096.1089 1111.8501 1114.4713 1120.1622 1120.5701 1145.2460 1146.1395 1152.3649 1155.6810 1160.7157 1172.4761 1193.2155 1198.9114 1218.7301 1224.4956 1228.3586 1247.9956 1257.2893 1263.6246 1264.0662 1269.3535 1284.5888 1288.6266 1292.8209 1327.4406 1330.1461 1338.9452 1339.2512 1342.3840 1348.5791 1363.6630 1366.7697 1376.6459 1386.5023 1397.6792 1419.1033 1423.6396 1435.9882 1451.4840 1452.9415 1457.3325 1460.0709 1460.9279 1468.3439 1468.5442 1471.1127 1473.6696 1477.4178 1481.2535 1483.8482 1553.6848 1576.5950 1577.7190 1587.8304 1605.0207 1610.8719 1632.0217 2816.5989 2828.0529 2886.7470 2956.0117 2966.7250 2983.7108 2985.1957 2989.3551 3019.1188 3032.0288 3041.5285 3042.5145 3044.4213 3053.5857 3105.8374 3125.1572 3150.1752 3155.1848 3158.6181 3171.9370 3176.3078 3183.6332 3190.2444 3197.9926 3454.2830 3582.7695
redmass: 5.4871 5.1638 3.9065 5.6063 6.2123 3.6374 4.3866 3.7886 5.3270 4.2592 5.7470 5.7304 4.9309 4.9731 4.6901 5.1408 4.1326 3.1929 3.3515 4.4748 2.1996 2.0340 2.7526 4.2154 3.3163 1.2071 1.9589 5.5810 5.1545 1.1976 5.8643 5.9176 3.5578 4.7283 2.5720 4.5223 4.2689 3.5912 3.8350 2.9189 3.3733 4.2177 6.5800 3.4303 4.8760 3.4684 4.5069 5.0897 3.4436 3.9437 4.2499 6.7988 5.3438 5.2213 6.7411 4.4588 4.1258 6.1336 6.3579 3.5285 3.9837 3.4936 1.7398 1.4957 1.4905 1.6243 5.7869 2.1183 1.6802 1.4253 2.2505 1.3752 1.4550 1.4282 6.3909 1.3546 3.3677 5.5721 1.3899 1.2959 6.4316 1.9951 2.3259 3.0651 2.2367 2.3481 1.4250 2.1154 2.3800 1.2591 2.2732 1.8633 2.6335 1.4549 1.5175 1.3556 1.3652 1.8701 1.4708 1.3283 2.4364 2.0054 1.8211 2.1193 1.8905 1.6742 1.2150 1.6643 1.8184 1.4659 1.7983 1.3963 3.7598 1.3047 1.4091 1.5188 1.4195 1.4838 2.5260 2.1043 9.5832 1.6101 8.1265 4.1927 3.1906 1.2531 1.1016 3.4088 1.2845 1.1179 2.1200 1.0532 1.0926 1.1683 1.2740 2.2382 1.1081 2.5168 8.2426 9.7110 8.1537 6.6760 7.3868 7.2618 7.7236 1.0715 1.0703 1.0691 1.0333 1.0622 1.0619 1.0616 1.0873 1.0873 1.0954 1.0883 1.1038 1.1028 1.1036 1.0889 1.0989 1.0941 1.0917 1.0880 1.0888 1.0914 1.0951 1.0964 1.0922 1.0685 1.0659
irintensity: 0.0977 0.3989 0.4776 0.6229 0.0164 0.1838 2.5313 4.8768 0.8516 1.0284 1.0687 0.4991 0.0787 1.5434 4.9399 0.5978 2.4058 3.4210 2.7845 2.7697 0.6337 2.2478 5.8343 5.1833 8.6693 86.5301 4.4423 0.9181 8.6726 108.1503 2.3978 7.4343 2.0508 4.6382 0.2154 1.7614 14.8608 12.0264 10.2269 1.5491 0.5235 15.3462 5.3472 23.8025 17.7761 8.0647 4.3261 10.0180 4.3606 8.7278 4.6400 12.1532 5.8012 2.9468 6.4764 0.8676 4.2951 15.4858 6.6441 13.8045 11.4426 14.6605 33.4862 0.2714 63.6032 25.1380 55.2114 2.2434 10.7489 36.6629 4.0127 3.3820 9.4880 4.8454 20.4864 11.3611 18.1752 65.6552 4.2547 4.9011 69.1392 15.4839 20.4682 64.3961 22.8860 42.7154 6.0382 53.0635 96.0756 0.1808 48.7778 5.1910 4.0914 3.6579 57.2024 64.0630 13.2579 58.5856 32.9564 1.1266 81.4607 3.9718 4.0807 6.4838 129.2951 13.7328 2.2051 134.8961 14.6498 29.6362 74.2541 6.8192 4.7099 7.9744 1.4623 26.0133 71.2632 2.6180 14.4007 23.1764 26.0137 5.1700 70.6804 2.2303 29.2086 45.6496 12.7417 81.9829 45.6135 14.0945 300.2542 12.5935 8.0771 10.9144 52.6352 58.9842 6.2287 131.3269 67.1875 316.3326 53.8305 15.6890 167.8669 39.6937 82.1807 52.0654 190.7439 64.2535 99.1188 45.1024 35.9126 28.9192 9.6216 62.7307 72.8964 25.7032 50.9415 14.8923 107.5254 29.3788 23.7505 6.8434 4.7425 10.9962 0.5278 5.4813 8.6314 2.5540 0.6136 20.6026 48.3635
temp: 298.150 k
press: 1.00000 atm
elementType: 17 8 8 8 7 7 7 6 6 6 6 6 6 6 6 6 6 6 6 6 6 6 6 6 6 6 6 6 6 6 6 6 6 1 1 1 1 1 1 1 1 1 1 1 1 1 1 1 1 1 1 1 1 1 1 1 1 1 1
symmnumber: 1
zpe: 1220468.1 jmol-1
zpe.correction: 0.464852 hartree
zpe.thermalcorrener: 0.494001 hartree
zpe.thermalcorrenthalpy: 0.494946 hartree
zpe.thermalcorrgfe: 0.404203 hartree
zpe.sumelectzpe: -1853.912518 hartree
zpe.sumelectthermal: -1853.883369 hartree
zpe.sumelectthermalent: -1853.882424 hartree
zpe.sumelectthermalfe: -1853.973167 hartree
dipole: -2.9621 2.0714 2.3235
dipole: 4.2969
quadrupole: -173.4158 -178.7019 -196.8840
quadrupole: -21.4438 -10.7769 -9.6559
quadrupole: 9.5848 4.2986 -13.8834 -21.4438 -10.7769 -9.6559
hfenergy: -1854.3773699 hartree
pointgroup: C01 [X(C26H26Cl1N3O3)]
dipole: 1.4195103 0.3746223 -0.8382042 debye
polarizability: 473.9442747|16.7644964|433.0977245|37.276251|-2.7154787|219.858703 unknown
InChI: InChI=1S/C26H26ClN3O3/c1-33-20-7-9-23-22(15-20)26(21-8-5-18(27)14-24(21)30(23)32)28-19-6-10-25(31)17(13-19)16-29-11-3-2-4-12-29/h5-10,13-15,31-32H,2-4,11-12,16H2,1H3
charge 0 multiplicity 1
59 atoms
Cl 2.266502 -6.292454 1.452145
O  -4.671124 -1.777222 -2.479323
O  5.296061 -2.042057 0.631361
O  3.340105 4.073498 -0.049454
N  -4.613556 1.222925 0.527868
N  3.999643 -1.514165 0.269908
N  0.281621 0.173686 -0.558683
C  -4.514247 2.433132 -0.329715
C  -5.71337 1.347922 1.516682
C  -4.26546 3.695219 0.520784
C  -5.50336 2.57552 2.426489
C  -5.373666 3.865866 1.58459
C  -4.717718 -0.020652 -0.26969
C  -3.400885 -0.439938 -0.915333
C  -2.157342 0.019346 -0.434682
C  -3.407183 -1.332696 -2.019996
C  -0.925103 -0.407642 -1.004235
C  1.386438 -0.419444 -0.149759
C  2.58347 0.454975 0.019622
C  1.579731 -1.852132 0.222452
C  -2.197589 -1.745261 -2.624728
C  3.88071 -0.107104 0.236839
C  -0.962256 -1.293439 -2.120021
C  2.904382 -2.371005 0.440242
C  2.465056 1.859163 -0.072493
C  0.491299 -2.742316 0.442055
C  5.01311 0.7296 0.369404
C  3.115159 -3.727708 0.807238
C  3.591001 2.695653 0.058501
C  4.874261 2.127752 0.28499
C  0.677716 -4.084875 0.812435
C  1.99944 -4.553234 0.975972
C  4.481629 4.980555 0.080945
H  -5.454638 2.570363 -0.928543
H  -3.68805 2.285437 -1.047983
H  -5.740728 0.424702 2.126186
H  -6.710045 1.440113 1.006249
H  -4.219115 4.581174 -0.141519
H  -3.282191 3.599356 1.020872
H  -4.578199 2.425183 3.01608
H  -6.347857 2.654745 3.138321
H  -5.157642 4.733923 2.236071
H  -6.339952 4.0728 1.078752
H  -5.500919 0.047812 -1.063021
H  -5.04978 -0.83216 0.409387
H  -2.157958 0.719783 0.406264
H  -2.21573 -2.419299 -3.491986
H  -0.026557 -1.609214 -2.592878
H  1.474833 2.283268 -0.25748
H  -0.527796 -2.371523 0.319204
H  5.989843 0.284115 0.570254
H  4.126067 -4.09243 0.992689
H  -4.563547 -2.357634 -3.272902
H  5.760934 2.757256 0.402978
H  -0.175743 -4.747632 0.973813
H  5.725672 -2.279647 -0.23809
H  4.957248 4.89247 1.077599
H  4.060263 5.989361 -0.038691
H  5.23701 4.797513 -0.708638
