program: Gaussian 09
title: 000052032
version: EM64L-G09RevD.01
frameworkgroup: C1[X(C21H28NO2)]
method: RPBEPBE
basis: SDD
operation: Freq
keyword: #p
keyword: freq=noraman
keyword: PBEPBE/SDD
title: #p freq=noraman PBEPBE/SDD
converged: YES YES NO NO
title: Mulliken charges:
elementType: O O N C C C C C C C C C C C C C C C C C C C C C H H H H H H H H H H H H H H H H H H H H H H H H H H H H
charge: -0.286187 -0.272300 -0.122315 0.342277 -0.407649 -0.417890 -0.370736 -0.771582 0.054945 -0.568027 -0.553308 -0.557703 0.382994 0.368335 -0.364530 -0.365085 -0.398948 -0.406164 -0.221373 -0.224117 -0.217537 -0.223153 -0.232295 -0.234871 0.292746 0.252321 0.232147 0.257519 0.231104 0.198384 0.278646 0.229658 0.193920 0.262506 0.265828 0.291613 0.261836 0.274625 0.274514 0.266586 0.263025 0.271680 0.245392 0.254374 0.266681 0.266649 0.237191 0.239702 0.236596 0.236403 0.242233 0.243338
chargesum: 1.00000
title: Mulliken charges with hydrogens summed into heavy atoms:
elementType: O O N C C C C C C C C C C C C C C C C C C C C C
charge: -0.286187 -0.272300 -0.122315 0.342277 0.137418 0.071777 0.058752 -0.069359 0.054945 0.251920 0.257667 0.243588 0.382994 0.368335 -0.119138 -0.110710 -0.132268 -0.139515 0.015819 0.015585 0.019059 0.013250 0.009938 0.008467
polarizability: 2.46100362e+02 1.68422187e+01 2.35890247e+02 -2.25896856e+00 -6.40522195e+00 2.04725042e+02
1716.lowfreq: -13.8401 -11.2868 -7.5138 -0.0006 -0.0005 -0.0005 17.5998 23.9239 35.1459
frequency: 17.4033 23.2562 35.0923 41.4102 50.7595 59.2362 96.2889 112.8811 149.5447 176.9989 185.3306 188.5976 208.8919 239.0937 248.0142 258.3005 276.1981 295.8441 300.1805 309.2750 315.6412 320.2924 363.6764 383.5477 391.3247 397.5993 401.4743 406.8899 426.3067 434.9488 452.3459 469.4935 487.6741 513.8352 528.8199 598.7104 614.2273 614.6772 639.8552 651.5613 686.2691 701.3289 709.5198 717.3978 756.5424 758.2069 776.4848 844.1720 855.9532 860.6885 865.3030 884.8628 901.9821 910.9386 918.6573 928.1351 935.4028 939.3817 949.0552 954.3701 967.2844 975.5013 983.1013 986.7399 989.5545 990.2893 1004.9357 1006.1188 1016.7424 1024.3195 1030.2551 1039.2804 1044.3790 1081.5711 1087.3571 1092.6640 1100.2700 1136.5616 1157.9662 1176.5071 1177.6512 1183.5850 1187.8565 1191.0212 1199.3166 1219.1989 1226.4099 1242.7013 1248.1311 1255.9150 1287.4441 1312.4155 1320.3525 1322.8813 1354.4204 1356.8326 1374.4349 1379.7875 1385.0631 1396.2021 1420.1528 1422.2798 1432.9722 1438.2817 1442.8033 1452.6688 1453.8792 1458.4186 1460.3422 1468.4821 1471.2404 1475.6307 1478.5041 1479.5440 1483.2173 1486.4558 1494.6485 1501.3909 1589.6830 1594.0788 1608.7643 1610.6731 2966.6211 2973.8087 3003.7384 3009.8355 3022.5318 3029.9431 3033.2975 3061.2296 3075.1303 3078.6095 3082.1372 3085.3859 3132.8049 3134.0169 3137.5981 3139.5702 3140.0519 3141.5840 3144.8336 3145.5281 3152.8803 3153.9890 3162.4871 3163.4347 3165.3923 3169.0183 3172.8863 3175.6589
redmass: 4.6073 3.6985 3.7806 2.8257 4.9308 4.3469 3.8259 2.7931 3.0963 3.5768 3.4697 1.2459 2.3609 3.1570 1.4840 3.6155 1.2500 1.2145 3.3046 1.7498 3.8485 2.8601 2.7750 2.1801 2.3115 2.8630 2.8808 3.4961 2.8140 2.1895 4.3586 3.7662 3.0464 3.8147 3.5409 4.1694 6.4230 6.4384 5.4138 4.5965 6.1256 1.9552 1.7873 4.0083 3.8275 1.6681 1.9087 3.1678 1.2688 1.4856 1.8883 3.2155 2.5049 2.4329 1.9971 1.8786 2.4368 1.8788 2.4750 2.4610 2.2479 5.6577 1.4068 1.4771 4.5889 5.9768 1.3390 1.3327 1.7687 3.1359 1.9952 3.5214 1.1960 1.5843 1.3737 1.5785 1.3405 2.2582 1.7873 1.0578 1.0536 1.2888 1.2883 1.4319 2.4721 1.8397 2.0088 1.7794 3.2458 1.4987 1.4840 1.3348 1.3155 1.2415 1.3187 1.2340 1.2246 8.7890 9.1129 1.1906 1.1418 1.1482 2.1580 2.1945 1.0901 1.0510 1.0998 1.0759 1.0766 1.0503 1.0735 1.0522 2.2541 2.2286 1.0588 1.0542 1.0545 1.0511 6.1935 6.3104 6.0541 6.0214 1.0641 1.0387 1.0579 1.0590 1.0320 1.0329 1.0338 1.0989 1.1040 1.1026 1.1007 1.1041 1.0854 1.0854 1.1054 1.1048 1.0883 1.0885 1.1047 1.1054 1.0931 1.0936 1.0956 1.1053 1.0962 1.1040 1.1010 1.0999
irintensity: 3.0191 0.0717 0.0962 0.2545 0.6783 2.0233 2.2365 1.1481 2.0519 0.9453 5.3039 0.2840 1.5864 1.9001 0.5401 0.3945 0.1513 0.1437 2.0887 1.3851 5.1945 2.1082 4.2114 1.6741 0.6214 1.3105 0.5502 8.4707 4.8453 1.5168 5.0067 1.6684 4.7824 5.5603 12.2543 1.9168 0.5982 0.1581 20.1951 8.9908 10.2061 29.5539 83.0351 0.7532 5.2053 44.8244 71.5527 35.5468 0.5429 4.3997 4.6817 44.7141 44.7067 38.6201 3.3145 16.2255 16.7426 7.9630 4.1710 5.9162 7.8963 21.1116 0.1204 0.6569 0.4700 7.3264 0.2603 1.6711 1.7091 134.8093 5.9821 184.5732 0.0068 1.3613 4.4455 9.9848 0.8781 5.7170 2.4656 0.9112 0.2198 15.9497 39.0502 1.5350 61.7003 6.8038 6.4390 1.2607 47.1661 4.2924 3.6830 0.6660 5.5930 4.5562 1.9824 0.5473 7.1564 0.0310 1.1313 11.1978 18.7097 16.4339 0.7752 23.6967 5.8506 2.6817 0.9078 3.6428 16.1802 1.3453 33.0883 13.3023 12.3906 6.7104 27.3641 32.7885 46.0382 65.1256 0.0245 1.9219 0.2783 0.2668 50.9275 42.6971 9.1350 30.5515 3.0246 5.4840 8.2271 26.1046 11.3994 11.3430 4.0472 23.7170 1.2923 0.9425 0.6443 1.0996 2.4412 4.5578 12.5356 3.1772 18.5456 10.9291 14.0132 2.2056 18.9663 2.0340 12.4395 9.2067
temp: 298.150 k
press: 1.00000 atm
elementType: 8 8 7 6 6 6 6 6 6 6 6 6 6 6 6 6 6 6 6 6 6 6 6 6 1 1 1 1 1 1 1 1 1 1 1 1 1 1 1 1 1 1 1 1 1 1 1 1 1 1 1 1
symmnumber: 1
zpe: 1170134.9 jmol-1
zpe.correction: 0.445681 hartree
zpe.thermalcorrener: 0.468840 hartree
zpe.thermalcorrenthalpy: 0.469784 hartree
zpe.thermalcorrgfe: 0.392353 hartree
zpe.sumelectzpe: -1020.157002 hartree
zpe.sumelectthermal: -1020.133843 hartree
zpe.sumelectthermalent: -1020.132899 hartree
zpe.sumelectthermalfe: -1020.210330 hartree
dipole: 16.7824 -0.6167 -0.5455
dipole: 16.8025
quadrupole: -46.9875 -121.4103 -127.6443
quadrupole: 1.1476 -3.2974 -0.0837
quadrupole: 51.6932 -22.7296 -28.9636 1.1476 -3.2974 -0.0837
hfenergy: -1020.6026831 hartree
pointgroup: C01 [X(C21H28N1O2)]
dipole: 6.6099919 -0.0014683 -0.0917509 debye
polarizability: 244.8788427|17.126708|235.8971842|-2.7306393|-8.8232907|205.9396236 unknown
InChI: InChI=1S/C21H28NO2/c1-20(15-22(2,3)4)16-23-21(24-17-20,18-11-7-5-8-12-18)19-13-9-6-10-14-19/h5-14H,15-17H2,1-4H3
charge 1 multiplicity 1
52 atoms
O  0.072695 -0.510842 -1.085003
O  -0.147972 -0.492264 1.310234
N  4.395668 0.079134 -0.096827
C  2.01152 -1.187157 0.288161
C  3.048016 -0.50351 -0.646875
C  0.892453 -1.667479 -0.716785
C  1.274349 -0.158275 1.230136
C  2.51848 -2.412367 1.082717
C  -0.845642 -0.159853 0.042128
C  5.43534 -1.032255 0.057228
C  4.912791 1.075303 -1.1399
C  4.240109 0.809145 1.232502
C  -2.109012 -1.019522 -0.002791
C  -1.105289 1.34562 -0.05945
C  -2.765958 -1.202825 -1.245141
C  -1.563807 2.039687 1.088191
C  -2.653668 -1.593046 1.171475
C  -0.948614 2.041074 -1.283135
C  -3.954956 -1.959353 -1.312383
C  -1.854277 3.41902 1.013974
C  -3.845841 -2.348705 1.100042
C  -1.24489 3.421402 -1.355065
C  -4.499688 -2.533144 -0.139277
C  -1.697507 4.113851 -0.208526
H  2.536628 0.340331 -1.146229
H  3.37756 -1.217153 -1.423949
H  1.310314 -2.060177 -1.659306
H  0.279142 -2.452094 -0.237418
H  1.636211 -0.221772 2.269243
H  1.385265 0.882189 0.861042
H  1.665009 -2.869898 1.613897
H  2.954588 -3.188264 0.425731
H  3.262598 -2.151071 1.858825
H  6.366091 -0.596811 0.452928
H  5.626036 -1.481388 -0.929317
H  5.055888 -1.796728 0.74632
H  5.923586 1.405434 -0.853741
H  4.945232 0.581089 -2.122809
H  4.232749 1.939396 -1.181066
H  5.207939 1.262727 1.498273
H  3.942102 0.092695 2.009696
H  3.478193 1.594718 1.131034
H  -2.344706 -0.758579 -2.153162
H  -1.693696 1.497574 2.030918
H  -2.145018 -1.452662 2.129313
H  -0.60359 1.50182 -2.170235
H  -4.45839 -2.09816 -2.2751
H  -2.212672 3.948507 1.903256
H  -4.264079 -2.790663 2.010789
H  -1.132996 3.953187 -2.306327
H  -5.425521 -3.115974 -0.191551
H  -1.935163 5.181391 -0.268283
