program: Gaussian 09
title: 000051922
version: EM64L-G09RevD.01
frameworkgroup: C1[X(C12H13I2N3O3)]
method: RPBEPBE
basis: SDD
operation: Freq
keyword: #p
keyword: freq=noraman
keyword: PBEPBE/SDD
title: #p freq=noraman PBEPBE/SDD
converged: YES YES NO NO
title: Mulliken charges:
elementType: I I O O O N N N C C C C C C C C C C C C H H H H H H H H H H H H H
charge: 0.032452 0.042152 -0.238576 -0.232176 -0.239906 -0.439646 -0.499370 -0.428015 0.335708 0.263697 0.566006 -0.595225 -0.291544 -0.395806 0.273775 0.219097 0.265480 -0.843824 -0.779437 -0.841912 0.299774 0.283051 0.310328 0.302866 0.309841 0.305197 0.319298 0.322291 0.216857 0.263769 0.258371 0.317548 0.317880
chargesum: 0.00000
title: Mulliken charges with hydrogens summed into heavy atoms:
elementType: I I O O O N N N C C C C C C C C C C C C
charge: 0.032452 0.042152 -0.238576 -0.232176 -0.239906 -0.136779 -0.189529 -0.122818 0.335708 0.263697 0.566006 -0.295452 -0.008494 -0.085478 0.273775 0.219097 0.265480 -0.202235 -0.040441 -0.206484
polarizability: 3.40667495e+02 2.23151090e+01 2.56207996e+02 6.89211284e-01 4.25787310e+00 9.03959719e+01
1716.lowfreq: 0.0004 0.0005 0.0005 1.5966 2.7209 4.5492 13.0133 14.7989 29.6238
frequency: 12.9408 14.5611 29.5872 32.9465 47.3888 49.6092 54.8305 58.9180 67.0136 88.1433 94.0572 103.5897 112.5501 177.6382 208.3833 251.0369 267.5045 280.0432 284.2350 324.3034 344.8348 381.7876 434.2057 448.3551 454.4810 476.1843 539.4094 553.5844 558.5129 582.3452 594.6963 605.7181 626.4256 632.0625 647.2397 677.3228 725.0016 728.1198 754.1046 808.1757 829.5092 834.2043 835.6296 849.2259 899.7606 906.1179 932.2045 947.3794 980.9197 989.6240 1001.4976 1038.4014 1116.3426 1137.1833 1141.2822 1179.7345 1196.3374 1205.6859 1209.5189 1223.4326 1226.6653 1251.8979 1294.8502 1320.0141 1378.9441 1388.7125 1408.3732 1410.2029 1428.8905 1446.5470 1456.4687 1468.9138 1482.5385 1522.8485 1544.5028 1594.5622 1598.7486 1605.0248 1630.0411 1635.8363 2994.2851 3064.8028 3067.1055 3090.4646 3105.2044 3147.7711 3151.4359 3165.0571 3188.6052 3204.2073 3433.6479 3443.8497 3502.5147
redmass: 7.4888 7.5936 5.8882 19.0377 2.0684 7.5910 3.0642 2.0340 3.4744 5.4159 4.7925 6.5273 4.2960 7.1816 5.9194 6.8374 5.2030 7.2457 8.4251 8.2531 5.9770 4.7819 6.1828 3.3076 4.2507 4.1443 2.6104 2.6269 4.2021 1.4642 3.4814 5.2681 4.9831 3.5232 5.8910 5.7605 2.2211 1.3406 1.3222 5.5156 2.9341 1.7354 1.8258 1.6514 3.3343 1.9981 5.4834 5.9594 1.3332 1.8133 2.9906 1.6418 2.3702 1.1561 1.1457 1.7980 1.5713 1.5895 1.6450 1.9589 1.6767 1.9042 1.7966 2.9422 5.8690 1.2201 1.1538 1.1146 3.7125 1.1450 1.6598 1.0913 2.4907 2.7246 2.0389 7.5308 7.2964 4.1490 6.2849 6.6743 1.0366 1.0577 1.0565 1.0995 1.0987 1.1078 1.1066 1.0930 1.0899 1.0968 1.0763 1.0771 1.0766
irintensity: 0.5302 0.4309 9.4867 0.1522 8.7474 1.0940 3.0313 11.9482 8.2794 0.3154 3.2314 2.5614 1.9561 7.8463 7.0397 0.4257 1.7288 1.0435 5.0890 1.8525 25.9358 2.7446 7.0156 12.6103 5.8800 8.2473 24.0252 17.5575 7.9637 100.3480 15.2404 156.4366 40.0002 25.0061 13.4761 2.5797 7.0591 46.6168 31.0521 1.8085 0.2173 24.9800 22.8865 31.0149 10.7746 52.5007 0.5001 2.1696 2.3901 24.9837 6.5496 16.7929 7.7579 5.0555 0.0456 16.9719 0.7245 8.6541 145.0274 25.8969 32.0877 64.4753 131.2919 1.9474 43.8313 82.6917 108.1127 30.6120 169.0757 87.0739 294.6474 7.9963 247.8308 849.5459 87.7145 363.0660 96.9042 86.9728 28.2789 168.8246 10.5491 0.7623 1.5644 15.0179 9.7642 0.1371 0.3354 7.7862 2.1852 3.8871 88.1890 117.9894 18.9835
temp: 298.150 k
press: 1.00000 atm
elementType: 53 53 8 8 8 7 7 7 6 6 6 6 6 6 6 6 6 6 6 6 1 1 1 1 1 1 1 1 1 1 1 1 1
symmnumber: 1
zpe: 629471.2 jmol-1
zpe.correction: 0.239753 hartree
zpe.thermalcorrener: 0.261210 hartree
zpe.thermalcorrenthalpy: 0.262154 hartree
zpe.thermalcorrgfe: 0.181157 hartree
zpe.sumelectzpe: -876.601594 hartree
zpe.sumelectthermal: -876.580137 hartree
zpe.sumelectthermalent: -876.579193 hartree
zpe.sumelectthermalfe: -876.660190 hartree
dipole: 3.4023 -2.5284 -1.4452
dipole: 4.4785
quadrupole: -130.9383 -165.6569 -149.4046
quadrupole: 4.0591 -6.5641 -10.6992
quadrupole: 17.7283 -16.9903 -0.7380 4.0591 -6.5641 -10.6992
hfenergy: -876.8413471 hartree
pointgroup: C01 [X(C12H13I2N3O3)]
dipole: 1.4679587 -0.9335316 -0.279606 debye
polarizability: 333.6453671|31.9445416|258.8395416|21.3878407|-17.94479|94.7865537 unknown
InChI: InChI=1S/C12H13I2N3O3/c1-7(18)15-9-3-2-8(16-11(19)5-13)4-10(9)17-12(20)6-14/h2-4,15-17H,5-6H2,1H3
charge 0 multiplicity 1
33 atoms
I  5.064787 -2.05024 1.048035
I  -5.321152 -2.763972 0.049398
O  0.920096 -3.316645 0.220517
O  2.237709 3.618758 0.669516
O  -4.245006 1.469456 -0.667882
N  1.874492 -1.17634 0.456878
N  2.441101 1.457548 -0.22126
N  -2.925776 -0.424946 -0.194789
C  0.778496 -0.3259 0.121007
C  1.070092 1.045688 -0.158417
C  -1.608424 0.119403 -0.175277
C  -0.553704 -0.788792 0.085811
C  0.000759 1.940328 -0.384893
C  -1.334451 1.495199 -0.390624
C  1.896183 -2.553516 0.49973
C  2.949957 2.713152 0.154947
C  -4.114309 0.229257 -0.424244
C  3.184064 -3.248209 0.953576
C  4.441078 2.896919 -0.115442
C  -5.416966 -0.57983 -0.394033
H  -0.749615 -1.8497 0.262835
H  0.222631 2.995509 -0.553855
H  -2.154582 2.190736 -0.573484
H  2.733206 -0.701127 0.761533
H  3.093755 0.828467 -0.697898
H  -2.998999 -1.433961 -0.017231
H  3.057385 -3.64461 1.973499
H  3.403162 -4.072468 0.260239
H  4.955991 1.974349 -0.436305
H  4.922991 3.27518 0.80144
H  4.57557 3.66692 -0.89569
H  -5.905907 -0.511506 -1.377574
H  -6.081316 -0.161804 0.377039
