program: Gaussian 09
title: 000051806
version: EM64L-G09RevD.01
frameworkgroup: C1[X(C9H20)]
method: RPBEPBE
basis: SDD
operation: Freq
keyword: #p
keyword: freq=noraman
keyword: PBEPBE/SDD
title: #p freq=noraman PBEPBE/SDD
converged: YES YES NO NO
title: Mulliken charges:
elementType: C C C C C C C C C H H H H H H H H H H H H H H H H H H H H
charge: 0.041465 -0.416928 -0.401389 -0.428747 -0.367683 -0.355727 -0.718469 -0.720668 -0.698382 0.178755 0.193363 0.182583 0.194532 0.199708 0.205598 0.208422 0.186513 0.197915 0.193660 0.194727 0.218895 0.213498 0.210420 0.220836 0.220446 0.212497 0.209477 0.214942 0.209738
chargesum: 0.00000
title: Mulliken charges with hydrogens summed into heavy atoms:
elementType: C C C C C C C C C
charge: 0.220220 -0.040981 -0.007149 -0.014726 0.016745 0.032660 -0.075655 -0.066889 -0.064225
polarizability: 1.15512014e+02 -1.27113820e+00 9.27060138e+01 1.25506646e-01 4.88043373e-01 8.54129794e+01
1716.lowfreq: -10.4447 -1.5282 -0.0005 -0.0003 0.0005 14.2268 43.5609 64.4146 75.1083
frequency: 42.8381 64.4050 75.0962 105.9630 110.7162 143.8808 215.0343 225.7845 233.8439 246.1480 283.3410 295.5006 328.3192 439.9895 479.6257 531.7008 724.0860 739.3620 750.0914 790.3429 821.9430 884.5136 903.7237 926.2722 962.8277 1002.9277 1021.1285 1025.9130 1037.8464 1055.6809 1082.5775 1093.4246 1145.5192 1155.1999 1165.7457 1210.2990 1239.8895 1254.0040 1266.1023 1274.9968 1288.7911 1290.7454 1323.9101 1338.3433 1347.6073 1352.7649 1353.9421 1387.4287 1389.3661 1392.5901 1458.7885 1464.8082 1469.2354 1472.9608 1476.2762 1477.8581 1480.7883 1485.5089 1486.4140 1489.3967 1496.4740 2928.9928 2950.7098 2954.9514 2965.1301 2967.5698 2971.1007 2973.2700 2978.3449 2985.3339 2990.7200 3004.7097 3014.4138 3023.1696 3032.5775 3065.6709 3067.5236 3069.5167 3069.9847 3070.9920 3073.8527
redmass: 2.2503 1.8881 2.3422 2.7479 2.1665 1.3784 1.0916 1.1582 2.1313 1.6879 2.4316 2.6472 2.1655 2.6457 2.3489 2.1102 1.1071 1.9088 1.1751 1.2021 1.3737 1.9236 1.5063 1.3944 2.3828 1.3788 1.6034 1.7926 1.7741 2.2768 2.3138 2.1453 1.8597 1.8946 2.6225 1.4822 1.2796 1.2507 1.2040 1.1660 1.1281 1.1743 1.4344 1.4663 1.5819 1.3945 1.5301 1.2168 1.2207 1.2178 1.0699 1.0712 1.0574 1.0587 1.0429 1.0589 1.0702 1.0623 1.0518 1.0678 1.0708 1.0816 1.0593 1.0597 1.0591 1.0584 1.0363 1.0377 1.0382 1.0637 1.0922 1.1015 1.1002 1.1000 1.1034 1.0993 1.1006 1.0987 1.0993 1.0996 1.0996
irintensity: 0.0080 0.0032 0.0092 0.0155 0.0129 0.0117 0.0029 0.0045 0.0270 0.0416 0.0420 0.0773 0.0864 0.3377 0.3608 3.7762 7.0218 2.3062 9.3880 5.0846 2.8228 5.0424 4.9851 6.4570 3.7759 3.8236 3.5153 0.5745 0.1735 2.8410 1.4557 8.1915 1.7093 1.0870 1.8744 0.4714 0.9443 0.3792 1.1307 2.7995 0.8366 0.3899 0.2834 0.7682 1.6278 0.4106 0.8598 10.7657 17.0734 17.2884 0.1378 0.3832 3.4478 6.0542 14.2486 2.6162 27.6389 9.7626 6.9867 11.5093 6.6128 20.7816 1.5873 7.9862 3.9088 131.3197 40.4021 23.3359 49.3500 22.3017 17.2964 0.4257 27.3811 29.4335 87.5764 39.7003 87.7811 52.2546 66.4002 88.3663 46.1791
temp: 298.150 k
press: 1.00000 atm
elementType: 6 6 6 6 6 6 6 6 6 1 1 1 1 1 1 1 1 1 1 1 1 1 1 1 1 1 1 1 1
symmnumber: 1
zpe: 707227.1 jmol-1
zpe.correction: 0.269369 hartree
zpe.thermalcorrener: 0.281909 hartree
zpe.thermalcorrenthalpy: 0.282853 hartree
zpe.thermalcorrgfe: 0.230474 hartree
zpe.sumelectzpe: -354.175183 hartree
zpe.sumelectthermal: -354.162643 hartree
zpe.sumelectthermalent: -354.161699 hartree
zpe.sumelectthermalfe: -354.214078 hartree
dipole: -0.0130 -0.0854 0.0329
dipole: 0.0924
quadrupole: -61.8682 -60.3576 -60.7779
quadrupole: 0.1134 0.0846 -0.2578
quadrupole: -0.8670 0.6437 0.2233 0.1134 0.0846 -0.2578
hfenergy: -354.4445515 hartree
pointgroup: C01 [X(C9H20)]
dipole: -0.0049397 -0.0332726 0.01382 debye
polarizability: 115.5221286|-1.1794253|92.7165815|0.0241371|0.3102635|85.3922967 unknown
InChI: InChI=1S/C9H20/c1-4-7-8-9(5-2)6-3/h9H,4-8H2,1-3H3
charge 0 multiplicity 1
29 atoms
C  0.961768 -0.305718 0.334823
C  -0.373856 -0.561891 -0.418917
C  2.133989 -0.989861 -0.424503
C  1.220228 1.202901 0.62148
C  -1.642863 -0.050078 0.300079
C  -2.949366 -0.482824 -0.404777
C  3.499543 -0.919008 0.293201
C  1.375914 2.09682 -0.630123
C  -4.218779 0.044702 0.298123
H  0.879734 -0.805701 1.326969
H  -0.321052 -0.111124 -1.432066
H  -0.475988 -1.656315 -0.57884
H  1.865589 -2.054764 -0.581445
H  2.225423 -0.547801 -1.437758
H  2.130577 1.296548 1.245611
H  0.39099 1.594372 1.242817
H  -1.650922 -0.42486 1.345667
H  -1.622819 1.05673 0.366827
H  -2.985454 -1.590406 -0.455648
H  -2.930755 -0.125725 -1.455055
H  3.874872 0.118332 0.361155
H  4.261431 -1.512307 -0.24554
H  3.427801 -1.318282 1.323138
H  0.468502 2.079858 -1.261616
H  2.227328 1.776693 -1.258791
H  1.556594 3.147722 -0.337693
H  -4.221504 1.150651 0.333193
H  -5.137591 -0.278977 -0.224856
H  -4.275935 -0.322382 1.340445
