program: Gaussian 09
title: 000051860
version: EM64L-G09RevD.01
frameworkgroup: C1[X(C17H20O4)]
method: RPBEPBE
basis: SDD
operation: Freq
keyword: #pfreq=noraman
keyword: PBEPBE/SDD
title: #p freq=noraman PBEPBE/SDD
converged: YES YES NO NO
title: Mulliken charges:
elementType: O O O O C C C C C C C C C C C C C C C C C H H H H H H H H H H H H H H H H H H H H
charge: -0.242654 -0.244234 -0.416925 -0.207281 0.250852 0.145920 0.189008 0.205685 -0.389674 -0.439202 -0.265464 -0.381022 -0.387235 -0.108298 0.077744 -0.248313 -0.232910 -0.354261 -0.700982 -0.213436 -0.674206 0.231490 0.246462 0.203335 0.208838 0.313859 0.281545 0.238691 0.229682 0.231382 0.208880 0.209985 0.254537 0.218089 0.201206 0.326428 0.183404 0.183834 0.198087 0.233762 0.233393
chargesum: 0.00000
title: Mulliken charges with hydrogens summed into heavy atoms:
elementType: O O O O C C C C C C C C C C C C C C C C C
charge: -0.242654 -0.244234 -0.090497 -0.207281 0.250852 0.145920 0.189008 0.205685 -0.158184 -0.192741 0.146708 -0.067163 -0.105690 0.130393 0.077744 -0.018631 -0.001528 0.064604 -0.027150 0.153802 -0.008964
polarizability: 2.94983524e+02 4.33392076e-01 2.40102631e+02 2.21028630e+00 1.67473300e+00 1.10429257e+02
1716.lowfreq: -8.2354 -0.0006 0.0003 0.0007 2.1665 4.7331 14.7998 27.5146 33.7676
frequency: 14.7889 27.1704 33.6798 49.5199 54.0861 66.7203 85.9193 91.4884 116.7267 145.5059 154.7466 173.3112 199.3026 206.9104 214.3351 231.2994 233.0846 248.5412 278.5099 302.1670 337.2760 363.6420 385.2516 419.0408 431.8810 452.7457 467.3328 472.5597 510.9458 532.3463 557.7420 566.3685 629.4661 632.0736 656.7818 711.1152 749.2339 785.5798 787.5749 799.4115 812.7917 818.0668 829.3129 866.0243 882.6082 905.8395 913.2032 922.4901 931.3033 969.7017 990.1712 993.4203 1014.9074 1018.9632 1033.5332 1040.9626 1073.8610 1075.5346 1083.8885 1110.9720 1117.6733 1137.5639 1151.6729 1159.1863 1178.3304 1185.7439 1191.8396 1213.1243 1235.0491 1254.0395 1254.2279 1284.3092 1289.4753 1300.0725 1317.3560 1363.2023 1369.5649 1378.7772 1385.2424 1386.9339 1391.4589 1397.6539 1413.1288 1437.6065 1450.9308 1456.9351 1460.4329 1465.3912 1471.1725 1475.9795 1479.0829 1494.0794 1519.2251 1569.1736 1586.8846 1597.6163 1624.5635 2891.4962 2911.6661 2936.1260 2944.7834 2956.3222 2975.4909 2996.4452 3010.6691 3054.8776 3077.8684 3093.7653 3101.1275 3105.3616 3131.0465 3150.6171 3151.2082 3171.6635 3176.1043 3191.6338 3538.2605
redmass: 5.8520 4.0906 4.6263 1.9014 3.8424 3.3936 4.4848 4.9807 3.3450 3.1294 2.9812 4.1321 4.0133 2.3242 2.5154 1.1830 2.0752 3.6246 1.1082 4.9356 5.5112 4.7203 4.6774 3.2818 4.2309 3.5311 2.7840 2.8028 5.5342 3.3532 6.6140 4.9983 6.3565 2.6602 3.6675 6.0191 6.2225 1.4881 5.0384 1.8651 2.0868 1.0946 2.9872 2.9819 3.8924 1.5022 2.1612 1.4871 1.4304 4.4279 1.5857 1.6714 3.2401 1.3153 2.5876 1.3891 5.0970 3.7403 3.1584 3.9620 2.1964 1.4374 2.0326 1.6351 1.1178 1.1764 1.8555 1.0879 2.4278 1.6580 1.1618 1.6250 1.6174 1.3451 1.4374 3.0359 1.6195 1.4455 1.1577 1.5950 1.4228 1.3130 7.4161 2.4456 1.6632 1.0402 1.1018 1.3157 1.1223 1.0553 1.0619 1.0873 3.9745 6.3820 5.9944 8.0818 6.7407 1.0540 1.0544 1.1022 1.0558 1.1068 1.0386 1.0360 1.1045 1.0913 1.0936 1.0990 1.0987 1.1009 1.0869 1.0868 1.0927 1.0948 1.0964 1.0950 1.0659
irintensity: 0.5342 0.0261 7.0408 2.7886 0.6716 0.2711 3.5824 2.3708 1.7033 12.9437 1.8586 5.3720 2.4368 7.2607 5.3461 0.5222 2.0993 0.7606 176.7244 3.2598 2.7180 7.0356 0.0559 5.0819 23.1125 0.8990 1.5416 1.1739 8.8657 6.1613 1.6904 1.0895 29.3686 1.4181 0.8410 29.1497 1.7321 68.9059 1.1582 41.8192 9.4884 6.5584 46.5854 2.8849 38.6201 0.4370 22.9195 1.2638 2.3072 26.9697 1.3106 1.4377 43.9228 2.0096 24.9175 76.6481 151.3441 396.9722 11.7043 3.7498 14.6333 7.1121 51.7425 4.2081 8.2164 10.1186 109.4859 0.7963 363.6284 23.2036 1.2897 9.3610 12.2564 2.3251 1.1438 1.2310 7.5215 8.9304 22.0583 40.7508 5.4676 39.3822 1.4414 61.8063 27.3319 10.7597 17.3169 6.2404 20.9360 12.7710 9.4198 4.3813 153.7071 246.8581 80.4731 16.0185 20.6942 68.3461 79.4560 51.3946 44.3277 60.5624 25.9447 28.6789 28.0750 3.0392 53.8680 35.0768 20.7639 34.0765 10.5268 18.2520 21.2276 17.0040 7.0780 20.9586 4.9914
temp: 298.150 k
press: 1.00000 atm
elementType: 8 8 8 8 6 6 6 6 6 6 6 6 6 6 6 6 6 6 6 6 6 1 1 1 1 1 1 1 1 1 1 1 1 1 1 1 1 1 1 1 1
symmnumber: 1
zpe: 870133.6 jmol-1
zpe.correction: 0.331416 hartree
zpe.thermalcorrener: 0.352797 hartree
zpe.thermalcorrenthalpy: 0.353741 hartree
zpe.thermalcorrgfe: 0.278323 hartree
zpe.sumelectzpe: -959.110128 hartree
zpe.sumelectthermal: -959.088747 hartree
zpe.sumelectthermalent: -959.087803 hartree
zpe.sumelectthermalfe: -959.163222 hartree
dipole: -3.5604 -6.7778 -0.1974
dipole: 7.6586
quadrupole: -127.3672 -105.9607 -124.4910
quadrupole: -0.7413 2.1350 -1.6174
quadrupole: -8.0943 13.3123 -5.2180 -0.7413 2.1350 -1.6174
hfenergy: -959.4415442 hartree
pointgroup: C01 [X(C17H20O4)]
dipole: -1.3861955 2.6246048 -0.5184563 debye
polarizability: 294.9760696|-1.2131544|234.4314314|-2.0279043|-26.5869941|116.107911 unknown
InChI: InChI=1S/C17H20O4/c1-3-20-11-16(19)14-8-9-17(21-10-12(2)18)15-7-5-4-6-13(14)15/h4-9,12,18H,3,10-11H2,1-2H3
charge 0 multiplicity 1
41 atoms
O  -3.022688 0.158302 -0.208124
O  4.923794 0.644522 -0.529932
O  -5.664583 0.321921 -1.47209
O  3.361698 -1.421781 0.023558
C  0.353386 -1.415684 0.051479
C  -1.085763 -1.229976 0.034014
C  1.222664 -0.272184 -0.21687
C  -1.631642 0.079361 -0.235393
C  0.61781 0.972908 -0.483054
C  -0.786285 1.166753 -0.495264
C  -3.65822 1.447864 -0.509256
C  0.843401 -2.736559 0.332043
C  -1.96362 -2.333591 0.278907
C  -5.178642 1.24455 -0.434015
C  2.719568 -0.362068 -0.222388
C  -0.035303 -3.798311 0.573249
C  -1.447522 -3.603169 0.545429
C  3.504655 0.933305 -0.550941
C  -5.919976 2.594476 -0.486309
C  5.730126 1.839203 -0.825666
C  7.196738 1.414096 -0.778306
H  1.239088 1.849367 -0.689299
H  -1.184777 2.163449 -0.701858
H  -3.354804 1.791504 -1.521648
H  -3.336824 2.203731 0.23692
H  1.92292 -2.891306 0.352382
H  -3.041911 -2.157032 0.245781
H  -5.413386 0.713577 0.504401
H  0.37084 -4.794131 0.783658
H  -2.123131 -4.445348 0.730192
H  3.250349 1.718709 0.199146
H  3.193017 1.311073 -1.552795
H  -7.007582 2.4129 -0.493831
H  -5.680204 3.224446 0.389982
H  -5.659952 3.165207 -1.399751
H  -5.511821 0.727547 -2.364729
H  5.462548 2.239068 -1.830555
H  5.520025 2.634166 -0.073913
H  7.857958 2.273743 -0.992017
H  7.447206 1.013652 0.218777
H  7.390644 0.623937 -1.523509
