program: Orca
programVersion: 5.0.4
elementType: C C C C C C C H H H H O C C C H H C H H H H H H N H Br
charge: 0
multiplicity: 2
keywords: UHF def2-TZVPP def2-TZVPP/C DLPNO-CCSD(T) TightSCF CPCM(acetonitrile)
formula: C11H13BrNO
InChI: InChI=1/C11H13BrNO/c12-9-5-1-2-6-10(11(9)14)13-7-3-4-8-13/h1-2,5-6,9H,3-4,7-8H2
27 atoms
C  -1.262123 2.51132 -0.674773
C  -2.504794 2.056856 -0.193003
C  -2.76142 0.904886 0.514375
C  0.012623 1.970859 -0.533845
C  -1.814721 -0.077028 0.943351
C  0.464768 0.882653 0.237777
C  -0.3980 0.236639 1.267383
H  -1.302329 3.426351 -1.279852
H  -3.370894 2.685931 -0.434217
H  -3.809338 0.683214 0.754629
H  0.790918 2.514207 -1.081289
O  0.047872 -0.098771 2.353595
C  2.640421 0.91847 -0.929084
C  2.332972 -0.67226 0.867497
C  3.718132 -0.151777 -0.998917
H  3.056452 1.910255 -0.65437
H  2.09593 1.037827 -1.883326
C  3.788398 -0.658637 0.432765
H  1.821497 -1.616639 0.58489
H  2.192449 -0.533108 1.94874
H  3.393462 -0.96514 -1.675748
H  4.67476 0.241916 -1.381063
H  4.262044 -1.649929 0.529868
H  4.361522 0.050146 1.061176
N  1.734359 0.444508 0.120674
H  -2.202482 -0.765241 1.70579
Br -1.536715 -1.624945 -0.670567
elementType: C H O N Br
totalener: -3125.99731623 hartree
nucrepener: 1226.23950891 hartree
electener: -4352.23682514 hartree
oneelecener: -6775.62080268 hartree
twoeener: 2423.38397755 hartree
cpcmener: -0.01631127 hartree
kineticenergy: 3125.26927176 hartree
s2: 1.262713
chargesum: 0.0000000
charge: -0.110039 -0.126960 -0.152433 -0.183975 0.117478 0.095001 0.332258 0.123535 0.130740 0.134432 0.112359 -0.493622 -0.037552 -0.036466 -0.092641 0.076678 0.076427 -0.092034 0.065675 0.094829 0.058097 0.069836 0.067443 0.057671 -0.115953 0.190754 -0.361538
charge: -0.015507 -0.021025 -0.009065 -0.030653 -0.086096 -0.146781 -0.241058 0.035459 0.039316 0.039587 0.034752 0.062287 -0.033085 -0.030143 -0.014947 0.018401 0.021449 -0.017292 0.015719 0.010636 0.024362 0.020439 0.020664 0.023790 0.247677 0.049137 -0.018024
qa: -0.1100 -0.1270 -0.1524 -0.1840 0.1175 0.0950 0.3323 0.1235 0.1307 0.1344 0.1124 -0.4936 -0.0376 -0.0365 -0.0926 0.0767 0.0764 -0.0920 0.0657 0.0948 0.0581 0.0698 0.0674 0.0577 -0.1160 0.1908 -0.3615
va: 3.8817 3.8952 3.9075 3.8056 3.7232 3.8323 4.0360 0.9984 0.9984 1.0054 1.0083 1.9479 3.8897 3.8840 3.9195 0.9936 0.9981 3.9148 1.0024 1.0035 1.0159 1.0161 1.0167 1.0139 3.1018 0.9906 0.9168
corrType: DLPNO BASED
energy: -3128.649129772838
dipole: 29.61181 -29.11355 0.49826 21.93823 -20.41251 1.52572 4.62410 -5.27689 -0.65278
magnitude: 1.73269 au
magnitude: 4.40415 debye
