program: Gaussian 09
title: 000051822
version: EM64L-G09RevD.01
frameworkgroup: C1[X(C12H5Cl5)]
method: RPBEPBE
basis: SDD
operation: Freq
keyword: #pfreq=noraman
keyword: PBEPBE/SDD
title: #p freq=noraman PBEPBE/SDD
converged: NO NO NO NO
title: Mulliken charges:
elementType: Cl Cl Cl Cl Cl C C C C C C C C C C C C H H H H H
charge: 0.020563 -0.023950 -0.023946 0.036234 0.007126 0.423261 0.470664 -0.256341 -0.342199 -0.273166 -0.273125 -0.044141 -0.219397 -0.233626 -0.233616 -0.120078 -0.208580 0.258675 0.264808 0.263777 0.263777 0.243282
chargesum: 0.00000
title: Mulliken charges with hydrogens summed into heavy atoms:
elementType: Cl Cl Cl Cl Cl C C C C C C C C C C C C
charge: 0.020563 -0.023950 -0.023946 0.036234 0.007126 0.423261 0.470664 -0.256341 -0.083525 -0.273166 -0.273125 -0.044141 0.045411 0.030151 0.030161 -0.120078 0.034702
polarizability: 2.37477615e+02 -1.65897574e-02 1.42410443e+02 9.24490720e+00 -2.60412225e-02 1.38767670e+02
1716.lowfreq: -3.6392 0.0007 0.0015 0.0033 5.5437 7.7109 15.4976 37.2644 54.5323
frequency: 15.4830 37.2536 54.5293 78.1369 92.5191 127.4529 145.8796 193.5326 196.0276 204.8099 238.7071 252.9533 285.5004 305.2299 328.7509 382.4817 387.0949 430.1375 457.9656 468.8963 514.0455 523.6079 529.2301 570.3700 600.3955 680.6038 724.3154 730.2819 746.5518 746.6674 782.2487 805.5352 818.1762 897.4048 951.0358 973.1106 992.4247 1048.4375 1068.8817 1101.4184 1153.9202 1154.3513 1162.4678 1192.2490 1274.8334 1339.1488 1350.3265 1353.0576 1411.6294 1413.4194 1461.4739 1547.0679 1558.3786 1581.8462 1597.6926 3151.5182 3158.1074 3172.7572 3179.7992 3183.4368
redmass: 15.5702 17.5356 7.3184 30.4167 20.3034 8.0896 22.7540 4.6582 25.9177 31.8952 7.4141 16.6391 7.6451 7.0839 28.0632 7.2907 13.7290 5.4304 7.1488 10.7647 4.9357 5.3255 8.1859 4.2811 5.5024 7.7750 5.3071 7.6282 7.3535 4.1336 1.6082 7.5470 1.3926 1.3613 1.3538 1.3317 8.7416 5.0141 3.8046 2.7021 1.4441 1.4796 2.2253 1.3884 2.3995 5.4148 9.9685 6.4705 2.5420 2.2089 4.1773 8.3199 6.8514 7.5180 8.5576 1.0876 1.0891 1.0931 1.0974 1.0996
irintensity: 0.1538 0.0884 1.2670 0.0061 0.0879 1.2727 0.4028 0.0008 0.1926 0.0675 2.1177 0.4639 2.2544 0.0000 0.2989 4.0533 12.6477 1.9107 1.7090 9.8671 0.3656 0.0130 6.9924 4.6423 4.9788 8.6416 29.8661 24.4743 67.9308 38.4795 43.3350 37.1890 21.6705 0.0004 0.2692 0.5949 2.1820 4.1210 14.6875 6.0201 4.8795 9.3208 43.1002 13.9188 6.7049 25.2201 6.5016 28.5782 86.4308 68.1612 10.0826 4.0117 47.4165 28.7406 4.3077 4.9470 1.9406 0.5936 1.1204 6.0697
temp: 298.150 k
press: 1.00000 atm
elementType: 17 17 17 17 17 6 6 6 6 6 6 6 6 6 6 6 6 1 1 1 1 1
symmnumber: 1
zpe: 340251.2 jmol-1
zpe.correction: 0.129595 hartree
zpe.thermalcorrener: 0.145357 hartree
zpe.thermalcorrenthalpy: 0.146301 hartree
zpe.thermalcorrgfe: 0.083421 hartree
zpe.sumelectzpe: -2759.389203 hartree
zpe.sumelectthermal: -2759.373441 hartree
zpe.sumelectthermalent: -2759.372497 hartree
zpe.sumelectthermalfe: -2759.435377 hartree
dipole: 3.8390 0.0040 -2.0375
dipole: 4.3462
quadrupole: -117.6745 -134.4833 -128.3266
quadrupole: -0.0065 2.7391 -0.0134
quadrupole: 9.1537 -7.6552 -1.4985 -0.0065 2.7391 -0.0134
hfenergy: -2759.5187981 hartree
pointgroup: C01 [X(C12H5Cl5)]
dipole: 1.4866353 0.0016561 -0.8448141 debye
dipolederiv: -0.2019236 0.0005205 -0.2171782 0.0006232 -0.0095944 0.0012402 -0.2526139 0.0012409 -0.5378472 -0.2555918 0.2463104 -0.0138387 0.2060176 -0.6336427 0.0228595 -0.0230407 0.0225881 -0.0431105 -0.2557941 -0.2464175 -0.0148026 -0.2061078 -0.6332369 -0.0250965 -0.0238136 -0.0248231 -0.0432896 -0.3017767 -0.0006424 0.2931033 -0.0008226 0.0004287 0.0009115 0.3578929 0.0008796 -0.3965151 -0.7902476 0.0004681 -0.1514283 0.0004062 -0.024257 0.0001724 -0.1358122 0.0001699 -0.0901274 0.2351865 0.0000662 -0.0532441 0.0001697 0.0195007 0.0004002 -0.1013535 0.0004528 -0.1590372 0.2411542 -0.000031 -0.0425301 -0.0001319 -0.4414176 -0.0007768 -0.0196941 -0.000804 -0.0124254 0.126495 -0.0009348 0.4048351 -0.000988 -0.0049551 -0.0016477 0.4257583 -0.0016288 0.6938492 -0.0585498 -0.0000198 0.0103063 -0.0001786 -0.0923776 -0.0004078 0.0784262 -0.000393 0.0766153 0.2934601 -0.3854146 0.0361981 -0.2320774 0.9383127 -0.0349643 0.0333881 -0.0186409 -0.0382042 0.2937138 0.3855482 0.0377022 0.2322668 0.9377994 0.0386714 0.0342821 0.0222949 -0.0379593 0.1054071 0.0014084 -0.6119809 0.00152 -0.0238768 -0.0009961 -0.6519336 -0.0009771 0.4166589 -0.3001834 0.0000984 -0.0253373 -0.0000166 -0.0899349 -0.0001651 0.0242589 -0.0001858 -0.0180458 -0.2142752 0.1874168 -0.0031499 0.0946917 -0.2081127 0.0151989 -0.0011946 0.0159788 -0.1078792 -0.2143741 -0.1874195 -0.0038815 -0.0946698 -0.207853 -0.015601 -0.0015886 -0.0163479 -0.1079979 1.0947375 -0.0009537 0.3340857 -0.00071 -0.046043 -0.000237 0.2431736 -0.0002188 0.0436018 0.1120163 -0.0000396 0.0283943 -0.0000455 0.1630302 0.0005528 0.0233284 0.0005404 -0.1277475 0.0300181 -0.0001444 0.0688334 -0.0001641 0.1337648 0.0002877 0.078144 0.0002682 0.0087073 0.04475 0.0001149 -0.0428905 0.0001199 0.1600947 0.000381 -0.0405926 0.0003803 -0.0017694 0.0545331 -0.0426326 -0.0064354 -0.0607614 -0.0023786 -0.0043831 -0.0120802 -0.00522 0.1628843 0.0545796 0.0426256 -0.0062695 0.0607801 -0.0024551 0.0037637 -0.0118539 0.0046071 0.1629163 -0.093335 0.0000723 -0.0204914 0.0000784 0.0672041 -0.0001639 -0.0230811 -0.0001614 0.1567225 unknown
polarizability: 237.9283005|-0.0258438|142.4104583|6.3857393|-0.0250839|138.3169695 unknown
InChI: InChI=1S/C12H5Cl5/c13-7-2-1-3-8(14)10(7)6-4-5-9(15)12(17)11(6)16/h1-5H
charge 0 multiplicity 1
22 atoms
Cl -0.358226 -0.00562 2.451554
Cl 1.138589 2.7946 -0.180224
Cl 1.13735 -2.794214 -0.190698
Cl -3.571278 -0.004422 2.08836
Cl -4.831753 0.002817 -0.909987
C  -0.224139 0.000758 -0.329528
C  1.266689 0.000151 -0.178151
C  -1.084689 -0.001693 0.795322
C  -0.804999 0.003869 -1.620321
C  2.016152 1.202927 -0.110407
C  2.015614 -1.203203 -0.114901
C  -2.492574 -0.001125 0.644457
C  -2.202346 0.004499 -1.791238
C  3.418559 1.224882 0.01613
C  3.418012 -1.226256 0.011529
C  -3.040411 0.001998 -0.659209
C  4.116412 -0.000964 0.076914
H  -0.150536 0.005806 -2.496962
H  -2.646047 0.006879 -2.790326
H  3.948494 2.179719 0.068137
H  3.947519 -2.181522 0.059943
H  5.206409 -0.001388 0.177104
