program: Orca
programVersion: 5.0.4
elementType: Br
charge: 0
multiplicity: 2
keywords: def2-TZVPP def2-TZVPP/C DLPNO-CCSD(T) TightSCF CPCM(acetonitrile)
formula: Br
InChI: InChI=1/Br
1 atoms
Br 0.0000 0.0000 0.0000
totalener: -2572.39963411 hartree
nucrepener: 0.00000000 hartree
electener: -2572.39963411 hartree
oneelecener: -3581.88735590 hartree
twoeener: 1009.48772179 hartree
cpcmener: -0.00157010 hartree
kineticenergy: 2572.36692742 hartree
s2: 0.758683
energy: -13335.0737 -1774.0730 -1593.3986 -1593.1933 -1593.1933 -268.6219 -203.9634 -203.3263 -203.3263 -87.8681 -87.7198 -87.7198 -87.2798 -87.2798 -28.4021 -14.0858 -12.2927 -12.2927 9.3620 9.8492 9.8492 11.2160 11.4370 11.4371 12.1848 12.1848 17.7418 41.6073 41.8905 41.8905 42.8506 42.8506 47.4410 47.6104 47.6104 48.1272 48.1272 49.0317 49.0317 49.2873 50.4415 50.4415 118.9512 119.2204 119.2204 120.0495 120.0495 203.7263 electronvolt
energy: -13334.9567 -1774.0111 -1593.1578 -1593.1578 -1593.0806 -268.3965 -203.2682 -203.2682 -203.1693 -87.5775 -87.4975 -87.4975 -87.2671 -87.2671 -25.4986 -11.7412 -11.7412 -1.0623 9.9756 9.9756 10.8659 12.2492 12.2492 12.9671 12.9672 13.2433 18.4030 42.9588 42.9589 43.1738 43.1738 43.2460 48.9934 49.0047 49.0048 49.0329 49.0330 49.0604 49.0604 50.6465 50.6465 51.0101 119.6247 119.7479 119.7479 120.1134 120.1134 204.0984 electronvolt
chargesum: -0.0000000
charge: -0.000000
corrType: DLPNO BASED
energy: -2572.662354308359
dipole: 0.00000 -0.00000 -0.00000 0.00000 0.00000 0.00000 0.00000 -0.00000 -0.00000
magnitude: 0.00000 au
magnitude: 0.00000 debye
