program: Orca
programVersion: 5.0.2
elementType: Cl Cl Cl Cl S O O C C C C C C C C C C C C H H H H H H
charge: 0
multiplicity: 1
keywords: wb97x-d3
keywords: def2-TZVPP
keywords: def2/J RIJCOSX
keywords: DEFGRID2
keywords: scfconv7
keywords: smallprint printgap noloewdin
keywords: NOSOSCF
formula: C12H6Cl4O2S
InChI: InChI=1/C12H6Cl4O2S/c13-7-1-3-8(4-2-7)19(17,18)12-6-10(15)9(14)5-11(12)16/h1-6H
25 atoms
Cl -1.859237 -2.048614 2.744002
Cl -2.109715 1.997403 -1.957168
Cl -4.721242 1.142713 -0.425552
Cl 4.956246 1.422543 -2.557387
S  0.830073 -1.244827 1.271593
O  0.786277 -2.67104 0.982956
O  1.08877 -0.787253 2.629167
C  -0.742086 -0.550075 0.76711
C  2.007351 -0.491384 0.190982
C  -1.900846 -0.928612 1.440115
C  -0.820163 0.354308 -0.277168
C  2.612184 0.69966 0.569595
C  2.305449 -1.1062 -1.017419
C  -2.043634 0.881278 -0.656476
C  -3.123613 -0.40404 1.066191
C  -3.196397 0.502196 0.019753
C  3.5286 1.29128 -0.281895
C  3.221636 -0.513862 -1.868499
C  3.820301 0.680558 -1.493239
H  0.066708 0.662748 -0.812972
H  2.380641 1.175184 1.513163
H  1.833573 -2.034826 -1.308719
H  -4.023346 -0.699041 1.589053
H  4.007258 2.21882 0.000329
H  3.462452 -0.981434 -2.813109
elementType: Cl S O C H
totalener: -2850.42310585 hartree
nucrepener: 2079.12053429 hartree
electener: -4929.54364013 hartree
oneelecener: -8060.61193848 hartree
twoeener: 3131.06829834 hartree
cpcmener: -0.02322895 hartree
kineticenergy: 2844.43356220 hartree
xcener: -161.832876839451 hartree
chargesum: -0.0000000
charge: -0.030757 -0.038803 -0.037630 -0.066733 0.860331 -0.513733 -0.513227 -0.027152 -0.018449 -0.003789 0.023354 -0.124639 -0.125583 -0.036776 -0.112140 0.045850 -0.128571 -0.128426 0.107760 0.131266 0.153886 0.154307 0.129304 0.150535 0.149814
qa: -0.0308 -0.0388 -0.0376 -0.0667 0.8603 -0.5137 -0.5132 -0.0272 -0.0184 -0.0038 0.0234 -0.1246 -0.1256 -0.0368 -0.1121 0.0459 -0.1286 -0.1284 0.1078 0.1313 0.1539 0.1543 0.1293 0.1505 0.1498
va: 1.2922 1.2829 1.2795 1.2394 5.6184 1.9588 1.9594 3.8075 3.7595 4.0755 3.7791 4.0150 4.0143 4.1108 4.0840 3.9734 3.9908 3.9921 3.8863 1.0260 1.0120 1.0118 1.0168 1.0024 1.0027
dispcorr: -0.014420872 hartree
energy: -2850.437526716997
dipole: 12.26491 -12.32377 -0.05886 -3.06857 4.34007 1.27150 1.24501 -2.68297 -1.43796
magnitude: 1.92039 au
magnitude: 4.88125 debye
