program: Orca
programVersion: 5.0.2
elementType: Cl Cl Cl Cl S O O C C C C C C C C C C C C H H H H H H
charge: 0
multiplicity: 1
keywords: wb97x-d3
keywords: def2-TZVPP
keywords: def2/J RIJCOSX
keywords: DEFGRID2
keywords: scfconv7
keywords: smallprint printgap noloewdin
keywords: NOSOSCF
formula: C12H6Cl4O2S
InChI: InChI=1/C12H6Cl4O2S/c13-7-1-3-8(4-2-7)19(17,18)12-6-10(15)9(14)5-11(12)16/h1-6H
25 atoms
Cl 0.211409 0.44958 2.440421
Cl -4.252999 -0.267705 -1.813548
Cl -4.463016 1.968231 0.383682
Cl 5.440823 1.730551 -1.003906
S  0.487917 -1.869007 0.158349
O  0.272962 -2.670783 -1.038442
O  0.653106 -2.527829 1.44291
C  -0.89561 -0.741391 0.259129
C  1.878502 -0.814796 -0.137436
C  -1.003288 0.234386 1.245399
C  -1.903879 -0.890746 -0.678525
C  1.903928 -0.056379 -1.300654
C  2.938653 -0.809569 0.754522
C  -3.013165 -0.064251 -0.646028
C  -2.102634 1.072781 1.271173
C  -3.108016 0.922714 0.329071
C  3.003136 0.739384 -1.565393
C  4.046957 -0.024682 0.481992
C  4.065472 0.744251 -0.671191
H  -1.828424 -1.651636 -1.443537
H  1.077129 -0.064736 -1.999962
H  2.91702 -1.401837 1.658943
H  -2.183249 1.841915 2.02718
H  3.030578 1.343131 -2.461907
H  4.883003 -0.015473 1.167681
elementType: Cl S O C H
totalener: -2850.42586858 hartree
nucrepener: 2087.26786714 hartree
electener: -4937.69373572 hartree
oneelecener: -8076.91987739 hartree
twoeener: 3139.22614166 hartree
cpcmener: -0.02057108 hartree
kineticenergy: 2844.44351802 hartree
xcener: -161.835214868919 hartree
chargesum: 0.0000000
charge: -0.033156 -0.041543 -0.034991 -0.070122 0.876462 -0.524374 -0.511319 -0.023069 -0.023187 -0.030113 -0.035881 -0.154503 -0.112950 0.034843 -0.068555 0.026198 -0.126536 -0.113046 0.089671 0.140770 0.147181 0.157935 0.130376 0.150577 0.149334
qa: -0.0332 -0.0415 -0.0350 -0.0701 0.8765 -0.5244 -0.5113 -0.0231 -0.0232 -0.0301 -0.0359 -0.1545 -0.1130 0.0348 -0.0686 0.0262 -0.1265 -0.1130 0.0897 0.1408 0.1472 0.1579 0.1304 0.1506 0.1493
va: 1.2901 1.2757 1.2823 1.2349 5.6556 1.9640 1.9680 3.7749 3.6969 4.0648 3.9298 4.0638 3.9325 4.0100 4.0026 4.0072 3.9697 3.9855 3.8866 1.0312 1.0009 1.0168 1.0134 1.0014 1.0014
dispcorr: -0.014827140 hartree
energy: -2850.440695721893
dipole: 11.52000 -11.34534 0.17466 -5.18198 7.10183 1.91986 -0.99618 0.90578 -0.09040
magnitude: 1.92990 au
magnitude: 4.90542 debye
