program: Gaussian 09
title: 000051893
version: EM64L-G09RevD.01
frameworkgroup: C1[X(C18H30N2O3)]
method: RPBEPBE
basis: SDD
operation: Freq
keyword: #p
keyword: freq=noraman
keyword: PBEPBE/SDD
title: #p freq=noraman PBEPBE/SDD
converged: YES YES NO NO
title: Mulliken charges:
elementType: O O O N N C C C C C C C C C C C C C C C C C C H H H H H H H H H H H H H H H H H H H H H H H H H H H H H H
charge: -0.442247 -0.355996 -0.260511 -0.116796 -0.465792 -0.359359 -0.360074 -0.413191 -0.352775 -0.352366 -0.115784 -0.346413 -0.340412 -0.280451 -0.690488 -0.693706 0.285634 0.480220 -0.444257 -0.354933 -0.195384 -0.209751 -0.256350 0.202677 0.182780 0.185014 0.204028 0.228691 0.212366 0.202752 0.192813 0.187505 0.202237 0.220860 0.189490 0.191535 0.191843 0.192860 0.252079 0.253119 0.215756 0.214358 0.208611 0.212654 0.216187 0.209599 0.343373 0.322379 0.221304 0.299595 0.227290 0.227520 0.229909
chargesum: 0.00000
title: Mulliken charges with hydrogens summed into heavy atoms:
elementType: O O O N N C C C C C C C C C C C C C C C C C C
charge: -0.098874 -0.355996 -0.260511 -0.116796 -0.143413 0.026097 0.028968 0.027866 0.042790 0.037376 0.105076 0.034612 0.044291 0.224746 -0.051762 -0.055267 0.285634 0.480220 -0.222953 -0.055339 0.031906 0.017770 -0.026441
polarizability: 2.97409570e+02 3.23616024e+01 1.75446915e+02 -3.38014597e+00 7.52452041e-01 1.99118573e+02
1716.lowfreq: -6.9139 -2.2342 -0.0008 -0.0003 0.0007 4.7389 12.7999 16.6230 18.1994
frequency: 6.7736 16.2707 17.7721 34.1424 42.8548 45.2621 57.1001 63.3769 70.5955 71.7391 83.1673 105.9672 115.5244 129.3220 150.5166 157.4763 177.4603 194.0886 227.5215 231.1055 244.8079 251.0382 270.7698 288.1282 297.8557 316.2147 324.0410 342.5204 383.1758 397.5737 407.9605 414.5999 450.3971 499.1893 508.9851 514.3509 570.2559 591.8534 615.9683 634.2250 694.3026 697.1002 731.4858 731.5582 733.9026 766.4359 791.6110 795.1141 809.1592 834.8340 841.3880 843.2744 886.4648 898.5026 900.4512 913.9174 914.2581 926.2633 932.8962 972.1768 972.5556 983.5705 993.1014 997.1690 1015.5456 1024.4651 1029.5194 1062.3383 1068.9721 1080.1591 1081.5068 1090.7137 1099.4519 1109.9551 1112.7271 1127.2611 1152.5844 1162.5008 1173.1863 1190.1573 1190.4571 1212.9935 1230.0686 1232.1693 1237.4799 1254.0822 1258.0995 1270.7466 1276.1153 1282.1476 1287.8777 1298.5033 1302.3249 1323.8775 1329.6098 1341.6195 1342.2320 1345.4959 1366.1084 1369.3080 1378.2315 1379.5166 1386.7600 1390.1296 1390.9283 1432.7082 1457.5858 1464.3674 1466.6965 1470.9415 1471.7663 1476.1281 1476.7711 1476.9455 1480.2937 1481.9232 1485.6867 1488.9436 1490.7463 1516.5759 1601.4531 1617.6441 1671.3033 2850.6842 2859.5548 2922.1289 2961.8740 2962.5986 2972.5646 2973.3547 2974.1039 2976.2009 3002.7270 3003.1335 3012.0428 3019.9295 3026.9506 3038.5510 3042.2239 3045.1564 3055.1808 3068.2363 3070.6229 3072.4852 3073.4316 3104.2123 3112.5121 3133.3968 3145.3134 3166.1264 3189.4474 3544.2665 3545.2473
redmass: 4.7811 4.2143 4.3151 3.3192 4.9528 3.8289 1.5426 3.4780 2.9886 2.7260 4.8302 2.7767 2.5595 4.4483 2.7825 5.0290 2.8681 2.3240 1.1273 1.1428 5.4945 4.2225 3.2132 3.3098 3.1956 4.2389 2.5422 6.0231 1.6835 1.5902 2.9207 2.6689 2.8660 2.8952 2.8216 3.4976 3.8492 6.0708 6.2949 1.2477 4.6642 2.3516 2.2592 1.5050 1.0811 1.6642 1.2183 1.1864 4.4514 4.0305 1.2643 3.3578 3.1145 1.7534 1.8010 1.8497 1.8420 1.2399 1.2543 1.3687 2.4864 6.1500 7.0177 1.3054 2.8816 3.2844 2.1309 2.4748 2.3032 2.1911 2.4139 1.5603 2.1079 2.0723 2.2687 2.0621 3.1955 1.5953 1.0503 1.1332 2.0008 1.4289 1.4244 1.2504 1.4280 1.3183 2.1072 1.2770 1.3481 1.0798 1.0951 1.2284 1.2998 1.4004 1.3408 1.3839 1.4277 1.5081 1.3356 1.3944 1.4376 1.4131 5.4906 1.2158 1.2309 2.2393 1.1100 1.0717 1.0702 1.0692 1.0701 1.0856 1.0475 1.0425 1.0669 1.0664 2.2227 1.0887 1.0919 2.1886 5.2828 6.0570 8.9691 1.0710 1.0705 1.0692 1.0586 1.0588 1.0422 1.0383 1.0546 1.0587 1.0977 1.0952 1.0909 1.0904 1.0606 1.0847 1.1004 1.1005 1.0898 1.1001 1.1007 1.0994 1.0998 1.1090 1.0885 1.0868 1.0934 1.0995 1.0954 1.0752 1.0661
irintensity: 0.0765 0.4694 1.0671 0.0100 0.1645 0.1579 0.0805 1.1230 0.5151 2.4214 0.4920 0.3599 0.1962 1.0661 0.3531 3.4415 2.1753 2.7088 0.0162 0.1099 9.7222 3.7979 6.2003 3.2552 2.3447 11.0091 0.0593 1.9652 27.7760 128.8770 0.0070 5.6740 22.7692 2.0164 29.1369 1.6637 8.0978 2.1003 1.7698 41.4398 9.3975 74.3857 12.1390 4.6346 7.6957 104.9066 0.3278 0.2511 5.9795 22.2743 0.3315 21.5349 2.7009 13.7822 4.9323 5.0746 12.7672 5.2608 6.3252 1.6621 53.9504 36.7989 249.0565 2.2481 30.7081 0.1426 7.2271 50.3329 20.9973 3.6954 25.2793 35.6239 32.3738 45.8205 1.4905 3.7707 468.9696 14.9788 0.3839 6.5984 9.6371 14.9454 7.2900 4.9318 10.5509 2.1698 8.1341 2.0292 5.7136 0.1516 0.8767 7.1751 13.7214 53.8091 5.9907 0.9538 1.8338 1.0633 6.6361 12.2488 7.9662 44.3298 42.6010 6.9006 8.4483 126.2656 33.6239 0.8726 0.1369 1.1381 0.9101 16.6761 7.0065 12.6477 2.3117 3.2747 21.1601 17.4012 13.2234 481.0296 27.7247 95.2835 211.9248 37.8945 147.5912 78.6859 19.9298 23.8056 23.3214 31.8609 65.0970 57.4432 8.8234 9.1500 7.8160 7.0252 6.6263 14.3947 25.3279 54.8719 72.4210 83.3308 92.6183 56.1812 52.3760 12.3485 14.8251 0.5644 29.6994 22.9836 6.0525 20.3239 12.1794
temp: 298.150 k
press: 1.00000 atm
elementType: 8 8 8 7 7 6 6 6 6 6 6 6 6 6 6 6 6 6 6 6 6 6 6 1 1 1 1 1 1 1 1 1 1 1 1 1 1 1 1 1 1 1 1 1 1 1 1 1 1 1 1 1 1
symmnumber: 1
zpe: 1196828.5 jmol-1
zpe.correction: 0.455848 hartree
zpe.thermalcorrener: 0.482185 hartree
zpe.thermalcorrenthalpy: 0.483129 hartree
zpe.thermalcorrgfe: 0.393929 hartree
zpe.sumelectzpe: -1037.272693 hartree
zpe.sumelectthermal: -1037.246356 hartree
zpe.sumelectthermalent: -1037.245412 hartree
zpe.sumelectthermalfe: -1037.334612 hartree
dipole: 0.0163 2.1906 -2.1830
dipole: 3.0927
quadrupole: -126.1185 -151.5541 -139.4812
quadrupole: -0.6308 -7.5950 -2.3482
quadrupole: 12.9327 -12.5028 -0.4299 -0.6308 -7.5950 -2.3482
hfenergy: -1037.728541 hartree
pointgroup: C01 [X(C18H30N2O3)]
dipole: -0.0090062 -0.8801548 -0.8400899 debye
polarizability: 300.2878764|24.4155812|171.8060134|9.0288251|1.2106337|199.8811688 unknown
InChI: InChI=1S/C18H30N2O3/c1-3-5-12-20(13-6-4-2)14-17(21)15-23-18(22)19-16-10-8-7-9-11-16/h7-11,17,19,21H,3-6,12-15H2,1-2H3
charge 0 multiplicity 1
53 atoms
O  1.526905 3.141382 -1.531684
O  -0.431126 1.451879 -0.395307
O  -1.653781 1.253015 1.608695
N  2.899405 -0.249835 -0.522888
N  -2.607136 0.858464 -0.52994
C  2.514404 -1.641546 -0.877228
C  4.362579 -0.067392 -0.326142
C  2.297344 0.778933 -1.403986
C  1.086778 -2.010843 -0.419614
C  4.861896 -0.591113 1.037069
C  1.894822 2.050305 -0.612946
C  0.673092 -3.436711 -0.849299
C  6.391336 -0.443267 1.207931
C  0.78492 1.786539 0.405633
C  -0.747661 -3.810451 -0.37358
C  6.890822 -0.959944 2.574436
C  -1.596811 1.18859 0.357894
C  -3.958721 0.5266 -0.22994
C  -4.810889 0.220944 -1.324972
C  -4.469263 0.491564 1.094502
C  -6.160521 -0.116901 -1.100184
C  -5.823666 0.151087 1.300812
C  -6.677148 -0.154455 0.216047
H  3.228027 -2.328738 -0.385059
H  2.610711 -1.824156 -1.978177
H  4.947618 -0.552608 -1.148838
H  4.584882 1.015561 -0.388708
H  2.982433 1.096687 -2.223116
H  1.390663 0.36521 -1.882059
H  1.035125 -1.917835 0.683237
H  0.35727 -1.282205 -0.828178
H  4.585177 -1.65819 1.156544
H  4.334736 -0.041342 1.841363
H  2.774085 2.435063 -0.065697
H  0.729133 -3.518869 -1.954516
H  1.402838 -4.168942 -0.446409
H  6.906896 -0.99232 0.393236
H  6.673514 0.623291 1.090074
H  0.566206 2.678706 1.016388
H  1.046505 0.930983 1.050747
H  -0.81843 -3.772885 0.729535
H  -1.029567 -4.829448 -0.696618
H  -1.500114 -3.10668 -0.77772
H  6.412225 -0.408702 3.405589
H  7.985297 -0.842289 2.676514
H  6.652443 -2.032563 2.70356
H  0.60872 2.954066 -1.857871
H  -2.335961 0.859975 -1.515388
H  -4.417436 0.248364 -2.349452
H  -3.812099 0.726719 1.934147
H  -6.806989 -0.350284 -1.953329
H  -6.212844 0.125844 2.324851
H  -7.725647 -0.416757 0.391541
