program: Orca
programVersion: 5.0.2
elementType: S O O O O C C C C C C C C C C C C C C C C C C C H H H H H H H H H H H H H H H H H H H H H H H H H H
charge: 0
multiplicity: 1
keywords: wb97x-d3
keywords: def2-TZVPP
keywords: def2/J RIJCOSX
keywords: DEFGRID2
keywords: scfconv7
keywords: smallprint printgap noloewdin
keywords: NOSOSCF
formula: C19H26O4S
InChI: InChI=1/C19H26O4S/c1-5-14-21-24(20)23-18-9-7-6-8-17(18)22-16-12-10-15(11-13-16)19(2,3)4/h1,10-13,17-18H,6-9,14H2,2-4H3
50 atoms
S  2.4919 1.661815 -1.649203
O  0.733607 -2.280918 0.260096
O  2.929806 0.513693 -0.608243
O  1.928594 2.793338 -0.586528
O  1.333461 1.198811 -2.422388
C  1.810064 -1.616999 -0.402874
C  1.949844 -0.20643 0.185491
C  3.055882 -2.455111 -0.173318
C  2.427173 -0.216714 1.624852
C  3.50198 -2.465798 1.285662
C  3.689038 -1.049526 1.817819
C  -4.500072 -0.004157 0.24908
C  -0.515412 -1.737346 0.183672
C  -3.113665 -0.635913 0.189629
C  -1.022458 -1.127015 -0.954506
C  -1.315724 -1.82163 1.318969
C  -2.301797 -0.582377 -0.938492
C  -2.592099 -1.286194 1.311015
C  -4.874044 0.68772 -1.059989
C  -5.545636 -1.084719 0.54252
C  -4.527732 1.043769 1.367633
C  0.550217 3.183228 -0.566836
C  -0.186141 2.509207 0.491504
C  -0.779206 1.948299 1.373877
H  1.611197 -1.550909 -1.477583
H  0.988707 0.307981 0.131491
H  2.87581 -3.469513 -0.536647
H  3.854575 -2.047512 -0.798148
H  1.618065 -0.622673 2.238816
H  2.571914 0.812328 1.9604
H  2.769055 -2.995276 1.90074
H  4.434913 -3.026074 1.372571
H  4.532594 -0.574478 1.308596
H  3.947566 -1.075027 2.877976
H  -0.435431 -1.054079 -1.860216
H  -0.931979 -2.300814 2.211385
H  -2.649896 -0.101168 -1.842222
H  -3.181943 -1.363668 2.216402
H  -5.86535 1.134833 -0.968808
H  -4.907232 -0.008346 -1.900149
H  -4.178106 1.489552 -1.313548
H  -5.354644 -1.594743 1.487927
H  -5.565702 -1.839686 -0.245682
H  -6.542517 -0.642891 0.605824
H  -3.794629 1.833352 1.189303
H  -4.316605 0.606965 2.344892
H  -5.512454 1.512619 1.425509
H  0.550725 4.260211 -0.398443
H  0.064981 3.009812 -1.529572
H  -1.301339 1.453734 2.162189
elementType: S O C H
totalener: -1438.80086552 hartree
nucrepener: 2422.83365099 hartree
electener: -3861.63451652 hartree
oneelecener: -6784.71567842 hartree
twoeener: 2923.08116190 hartree
cpcmener: -0.02571736 hartree
kineticenergy: 1433.23121144 hartree
xcener: -120.338366903700 hartree
chargesum: -0.0000000
charge: 0.699372 -0.396124 -0.334879 -0.334773 -0.533606 0.200397 0.200281 -0.197153 -0.191218 -0.140663 -0.128612 0.375826 0.224855 -0.075836 -0.176553 -0.204991 -0.203536 -0.240087 -0.362042 -0.327149 -0.348777 0.036897 -0.353142 -0.012372 0.116318 0.027450 0.086620 0.083224 0.086068 0.089244 0.069137 0.080947 0.071413 0.079679 0.142060 0.138890 0.142919 0.139853 0.100495 0.100928 0.101058 0.097218 0.100495 0.097362 0.098391 0.100960 0.101296 0.139184 0.150082 0.282594
qa: 0.6994 -0.3961 -0.3349 -0.3348 -0.5336 0.2004 0.2003 -0.1972 -0.1912 -0.1407 -0.1286 0.3758 0.2249 -0.0758 -0.1766 -0.2050 -0.2035 -0.2401 -0.3620 -0.3271 -0.3488 0.0369 -0.3531 -0.0124 0.1163 0.0275 0.0866 0.0832 0.0861 0.0892 0.0691 0.0809 0.0714 0.0797 0.1421 0.1389 0.1429 0.1399 0.1005 0.1009 0.1011 0.0972 0.1005 0.0974 0.0984 0.1010 0.1013 0.1392 0.1501 0.2826
va: 4.0095 2.0452 2.0352 1.9942 1.9122 3.8498 3.7183 3.9797 4.0043 3.8910 3.8935 3.5569 3.8192 3.6017 3.8538 3.9991 3.8831 3.9895 3.9292 3.9155 3.9268 3.9362 3.6513 3.7191 1.0108 1.0643 1.0188 1.0213 1.0120 1.0219 1.0205 1.0107 1.0182 1.0118 1.0165 1.0096 1.0012 1.0039 1.0069 1.0011 1.0009 1.0037 1.0037 1.0034 1.0019 1.0030 1.0074 0.9866 0.9991 0.9499
dispcorr: -0.031654498 hartree
energy: -1438.832520020595
dipole: -22.75100 22.35201 -0.39899 -7.22774 7.86933 0.64159 11.76244 -10.93493 0.82751
magnitude: 1.12054 au
magnitude: 2.84818 debye
