program: Orca
programVersion: 5.0.2
elementType: S O O O O C C C C C C C C C C C C C C C C C C C H H H H H H H H H H H H H H H H H H H H H H H H H H
charge: 0
multiplicity: 1
keywords: wb97x-d3
keywords: def2-TZVPP
keywords: def2/J RIJCOSX
keywords: DEFGRID2
keywords: scfconv7
keywords: smallprint printgap noloewdin
keywords: NOSOSCF
formula: C19H26O4S
InChI: InChI=1/C19H26O4S/c1-5-14-21-24(20)23-18-9-7-6-8-17(18)22-16-12-10-15(11-13-16)19(2,3)4/h1,10-13,17-18H,6-9,14H2,2-4H3
50 atoms
S  2.699734 1.96671 -1.208282
O  0.747447 -2.135001 -0.116529
O  3.073493 0.684277 -0.30797
O  1.930092 2.895917 -0.084189
O  1.693703 1.582429 -2.204257
C  1.830989 -1.374452 -0.639144
C  2.067783 -0.173381 0.287332
C  3.040817 -2.292292 -0.692833
C  2.587733 -0.588063 1.652675
C  3.532309 -2.711678 0.688399
C  3.807982 -1.498289 1.56885
C  -4.600536 -0.165671 0.154568
C  -0.508866 -1.621349 -0.126191
C  -3.170692 -0.676999 0.017551
C  -1.407894 -2.164971 0.789927
C  -0.95123 -0.623872 -0.984008
C  -2.708781 -1.700816 0.850943
C  -2.262415 -0.164969 -0.900608
C  -5.582206 -1.305993 -0.142655
C  -4.819603 0.335827 1.587556
C  -4.896214 0.988405 -0.802688
C  0.519682 3.145375 -0.134462
C  -0.181306 2.462779 0.94216
C  -0.778992 1.895937 1.816627
H  1.601825 -1.031248 -1.652337
H  1.139076 0.387159 0.417363
H  2.799362 -3.163986 -1.305727
H  3.837728 -1.76224 -1.221425
H  1.777854 -1.103451 2.176336
H  2.801984 0.309592 2.23736
H  2.792709 -3.357061 1.170611
H  4.438431 -3.311959 0.581103
H  4.663962 -0.943075 1.173992
H  4.089649 -1.817107 2.574654
H  -1.078636 -2.950378 1.459809
H  -0.295078 -0.17055 -1.714101
H  -3.37315 -2.147654 1.581167
H  -2.554269 0.624372 -1.580177
H  -6.614323 -0.961446 -0.043875
H  -5.453059 -2.146785 0.541032
H  -5.455265 -1.683259 -1.159379
H  -4.132212 1.14921 1.830597
H  -4.674077 -0.452902 2.32745
H  -5.837174 0.71363 1.711766
H  -5.923153 1.330289 -0.661155
H  -4.795717 0.695659 -1.849663
H  -4.242835 1.845769 -0.62837
H  0.393911 4.224854 -0.037602
H  0.090848 2.855089 -1.096617
H  -1.294382 1.392577 2.604226
elementType: S O C H
totalener: -1438.81099090 hartree
nucrepener: 2405.60605786 hartree
electener: -3844.41704875 hartree
oneelecener: -6749.89727606 hartree
twoeener: 2905.48022731 hartree
cpcmener: -0.02115012 hartree
kineticenergy: 1433.21265745 hartree
xcener: -120.334018909048 hartree
chargesum: 0.0000000
charge: 0.693676 -0.372582 -0.328057 -0.331640 -0.522356 0.206169 0.182946 -0.200511 -0.186882 -0.138147 -0.132799 0.345383 0.291415 -0.108797 -0.267292 -0.223749 -0.169167 -0.202853 -0.322752 -0.329823 -0.355423 0.013534 -0.370995 0.028152 0.122054 0.037534 0.085688 0.082185 0.083613 0.088432 0.070420 0.079635 0.073457 0.079156 0.134248 0.143506 0.138512 0.139232 0.095185 0.095843 0.101127 0.095497 0.096478 0.096435 0.099676 0.099895 0.099188 0.138649 0.153962 0.272943
qa: 0.6937 -0.3726 -0.3281 -0.3316 -0.5224 0.2062 0.1829 -0.2005 -0.1869 -0.1381 -0.1328 0.3454 0.2914 -0.1088 -0.2673 -0.2237 -0.1692 -0.2029 -0.3228 -0.3298 -0.3554 0.0135 -0.3710 0.0282 0.1221 0.0375 0.0857 0.0822 0.0836 0.0884 0.0704 0.0796 0.0735 0.0792 0.1342 0.1435 0.1385 0.1392 0.0952 0.0958 0.1011 0.0955 0.0965 0.0964 0.0997 0.0999 0.0992 0.1386 0.1540 0.2729
va: 4.0138 2.0832 2.0391 1.9935 1.9271 3.8058 3.7809 3.9781 4.0045 3.8891 3.8892 3.5960 3.7761 3.6614 4.0707 3.8603 3.9765 3.9022 3.9172 3.9236 3.9300 3.9501 3.6441 3.6599 1.0110 1.0539 1.0179 1.0221 1.0144 1.0218 1.0201 1.0108 1.0177 1.0116 1.0134 1.0243 1.0016 1.0023 1.0040 1.0038 1.0040 1.0047 1.0044 1.0059 1.0074 1.0015 1.0013 0.9885 0.9972 0.9572
dispcorr: -0.030886711 hartree
energy: -1438.841877608919
dipole: -24.13408 23.68020 -0.45388 -10.84877 11.16859 0.31982 8.94297 -8.11959 0.82338
magnitude: 0.99310 au
magnitude: 2.52425 debye
