program: Orca
programVersion: 5.0.2
elementType: S O O O O C C C C C C C C C C C C C C C C C C C H H H H H H H H H H H H H H H H H H H H H H H H H H
charge: 0
multiplicity: 1
keywords: wb97x-d3
keywords: def2-TZVPP
keywords: def2/J RIJCOSX
keywords: DEFGRID2
keywords: scfconv7
keywords: smallprint printgap noloewdin
keywords: NOSOSCF
formula: C19H26O4S
InChI: InChI=1/C19H26O4S/c1-5-14-21-24(20)23-18-9-7-6-8-17(18)22-16-12-10-15(11-13-16)19(2,3)4/h1,10-13,17-18H,6-9,14H2,2-4H3
50 atoms
S  2.490273 1.732381 -1.151693
O  0.715525 -0.402958 1.14474
O  2.94066 1.107918 0.268896
O  0.849932 1.673999 -1.01018
O  2.711318 0.777736 -2.236987
C  1.731308 -1.073072 0.416007
C  3.021619 -0.295051 0.633762
C  1.904397 -2.500444 0.933579
C  4.212406 -0.979758 -0.023452
C  3.094266 -3.200261 0.290015
C  4.369729 -2.399286 0.5104
C  -4.86917 -0.811837 0.072951
C  -0.586885 -0.583193 0.831484
C  -3.366288 -0.758002 0.324455
C  -1.507824 0.042118 1.673471
C  -1.062186 -1.308591 -0.252422
C  -2.862356 -0.046038 1.418133
C  -2.432612 -1.384475 -0.490601
C  -5.21713 -1.637355 -1.164592
C  -5.570568 -1.439442 1.283235
C  -5.398828 0.612714 -0.13453
C  0.26036 2.605289 -0.10181
C  0.481615 3.988335 -0.507348
C  0.66271 5.131677 -0.8261
H  1.498154 -1.096179 -0.654066
H  3.203886 -0.23561 1.711249
H  2.04559 -2.461776 2.018735
H  0.986664 -3.065522 0.755466
H  5.11218 -0.393238 0.174017
H  4.082304 -1.018042 -1.106038
H  3.194904 -4.204506 0.706624
H  2.9173 -3.324286 -0.783135
H  5.216906 -2.880093 0.017485
H  4.604646 -2.370914 1.579293
H  -1.151953 0.605721 2.527746
H  -0.39635 -1.823898 -0.931465
H  -3.540132 0.460553 2.095126
H  -2.753065 -1.957384 -1.350388
H  -4.773772 -1.226361 -2.073834
H  -6.29907 -1.64741 -1.3095
H  -4.893743 -2.676187 -1.072563
H  -6.650784 -1.476529 1.12382
H  -5.397575 -0.871617 2.198967
H  -5.225889 -2.46092 1.456642
H  -6.476419 0.599752 -0.314054
H  -4.925238 1.090857 -0.994515
H  -5.22207 1.247295 0.735389
H  -0.806372 2.379701 -0.10557
H  0.619945 2.451318 0.919109
H  0.832452 6.146819 -1.108963
elementType: S O C H
totalener: -1438.81055302 hartree
nucrepener: 2359.27817286 hartree
electener: -3798.08872588 hartree
oneelecener: -6657.27206060 hartree
twoeener: 2859.18333472 hartree
cpcmener: -0.02583039 hartree
kineticenergy: 1433.21841753 hartree
xcener: -120.332866819628 hartree
chargesum: -0.0000000
charge: 0.689925 -0.331619 -0.327272 -0.306704 -0.531028 0.117092 0.147638 -0.177130 -0.185851 -0.137079 -0.129265 0.324005 0.309513 -0.118384 -0.354278 -0.159664 -0.138181 -0.199401 -0.358092 -0.324363 -0.325003 -0.022817 -0.442548 0.122015 0.089379 0.108497 0.086051 0.094718 0.089725 0.093595 0.080124 0.073435 0.081452 0.073170 0.134555 0.135697 0.139510 0.143240 0.100218 0.099547 0.100097 0.095431 0.094940 0.100417 0.095189 0.100761 0.094926 0.128554 0.145628 0.279633
qa: 0.6899 -0.3316 -0.3273 -0.3067 -0.5310 0.1171 0.1476 -0.1771 -0.1859 -0.1371 -0.1293 0.3240 0.3095 -0.1184 -0.3543 -0.1597 -0.1382 -0.1994 -0.3581 -0.3244 -0.3250 -0.0228 -0.4425 0.1220 0.0894 0.1085 0.0861 0.0947 0.0897 0.0936 0.0801 0.0734 0.0815 0.0732 0.1346 0.1357 0.1395 0.1432 0.1002 0.0995 0.1001 0.0954 0.0949 0.1004 0.0952 0.1008 0.0949 0.1286 0.1456 0.2796
va: 4.0211 2.0455 2.0169 1.9886 1.9200 3.7775 3.8472 3.9409 3.9512 3.9153 3.8935 3.6355 3.6674 3.7175 4.0622 3.9070 3.9647 3.9602 3.9272 3.9171 3.9164 3.9461 3.9311 3.5604 1.0365 1.0132 1.0201 1.0113 1.0181 1.0245 1.0104 1.0099 1.0103 1.0126 1.0154 1.0089 1.0000 0.9983 1.0012 1.0070 1.0013 1.0038 1.0046 1.0041 1.0043 1.0042 1.0046 0.9794 0.9931 0.9495
dispcorr: -0.027944539 hartree
energy: -1438.838497556729
dipole: -23.58317 23.37715 -0.20603 -19.88015 19.36255 -0.51760 5.92807 -4.70615 1.22193
magnitude: 1.34293 au
magnitude: 3.41346 debye
