program: Orca
programVersion: 5.0.2
elementType: S O N N C C C C C C C C C C C C C C C C C C C C C C C H H H H H H H H H H H H H H H H H H H H H H H H H H H H H H H H
charge: 0
multiplicity: 1
keywords: wb97x-d3
keywords: def2-TZVPP
keywords: def2/J RIJCOSX
keywords: DEFGRID2
keywords: scfconv7
keywords: smallprint printgap noloewdin
keywords: NOSOSCF
formula: C23H32N2OS
InChI: InChI=1/C23H32N2OS/c1-15(2)19-13-18(26-17-11-9-8-10-12-17)14-20(16(3)4)21(19)24-22(27)25-23(5,6)7/h8-16,24-25H,1-7H3
59 atoms
S  -4.471482 -0.059679 -1.542338
O  3.237704 0.805726 0.63047
N  -1.863897 0.101189 -1.436685
N  -2.861445 0.165379 0.605846
C  -0.000463 1.545098 -0.819732
C  0.15021 -0.864101 -0.46154
C  -0.55912 0.261928 -0.899747
C  -0.767638 2.78342 -1.225541
C  -0.432671 -2.258577 -0.513172
C  -3.864372 0.127974 1.680568
C  1.288519 1.680356 -0.321485
C  1.433006 -0.694846 0.047677
C  1.997447 0.568725 0.102874
C  -1.117531 3.615031 0.009034
C  -0.000655 3.619565 -2.246585
C  0.387089 -3.153096 -1.441764
C  -0.536864 -2.868911 0.883894
C  -3.010678 0.078938 -0.716352
C  -3.061382 0.264933 2.972801
C  -4.608882 -1.205004 1.69426
C  -4.83894 1.298215 1.573979
C  4.242944 -0.122083 0.518112
C  4.485219 -0.817476 -0.660373
C  5.066815 -0.288723 1.621974
C  5.560032 -1.692962 -0.719173
C  6.145729 -1.15767 1.543896
C  6.393723 -1.867835 0.377543
H  -1.70409 2.473249 -1.692015
H  -1.441817 -2.197431 -0.92248
H  1.749047 2.658549 -0.249635
H  1.985686 -1.55657 0.401839
H  -1.985174 0.127718 -2.437739
H  -0.219376 3.99491 0.499717
H  -1.676158 3.029523 0.740986
H  -1.731829 4.472661 -0.269513
H  -0.602438 4.472625 -2.563174
H  0.246713 3.039183 -3.136196
H  0.929431 4.01377 -1.833826
H  1.402146 -3.298962 -1.067178
H  -0.075979 -4.137185 -1.528609
H  0.458433 -2.729824 -2.444449
H  0.445765 -3.014656 1.335852
H  -1.123861 -2.239081 1.554667
H  -1.022866 -3.844534 0.834613
H  -1.911631 0.272656 0.937047
H  -2.510234 1.207659 3.000378
H  -2.344405 -0.552029 3.083326
H  -3.727801 0.243182 3.833989
H  -3.911002 -2.040152 1.777826
H  -5.201174 -1.341892 0.791538
H  -5.281175 -1.241941 2.552638
H  -5.503203 1.302947 2.439397
H  -5.449298 1.230294 0.675827
H  -4.304691 2.249876 1.556633
H  3.850186 -0.681027 -1.526474
H  4.868605 0.264988 2.530938
H  5.748633 -2.236227 -1.635773
H  6.790715 -1.281147 2.403868
H  7.232639 -2.548356 0.320884
elementType: S O N C H
totalener: -1478.77979843 hartree
nucrepener: 2726.04846433 hartree
electener: -4204.82826276 hartree
oneelecener: -7434.80053832 hartree
twoeener: 3229.97227555 hartree
cpcmener: -0.03140493 hartree
kineticenergy: 1473.02084707 hartree
xcener: -128.082567921461 hartree
chargesum: 0.0000000
charge: -0.523794 -0.341248 -0.167391 -0.121653 0.002626 0.095462 -0.015726 0.061604 0.051274 0.198249 -0.218918 -0.218824 0.223497 -0.282229 -0.293569 -0.294669 -0.282825 0.187653 -0.315792 -0.316249 -0.316528 0.304907 -0.208706 -0.260682 -0.142366 -0.121962 -0.191991 0.034664 0.040724 0.131400 0.147184 0.163214 0.091221 0.078311 0.098937 0.097320 0.099292 0.086050 0.084928 0.097879 0.100372 0.093005 0.077225 0.100801 0.175199 0.110377 0.113244 0.103330 0.097615 0.098830 0.100194 0.099644 0.098580 0.097706 0.158089 0.148381 0.162997 0.161373 0.161762
qa: -0.5238 -0.3412 -0.1674 -0.1217 0.0026 0.0955 -0.0157 0.0616 0.0513 0.1982 -0.2189 -0.2188 0.2235 -0.2822 -0.2936 -0.2947 -0.2828 0.1877 -0.3158 -0.3162 -0.3165 0.3049 -0.2087 -0.2607 -0.1424 -0.1220 -0.1920 0.0347 0.0407 0.1314 0.1472 0.1632 0.0912 0.0783 0.0989 0.0973 0.0993 0.0861 0.0849 0.0979 0.1004 0.0930 0.0772 0.1008 0.1752 0.1104 0.1132 0.1033 0.0976 0.0988 0.1002 0.0996 0.0986 0.0977 0.1581 0.1484 0.1630 0.1614 0.1618
va: 1.8665 2.0711 3.1949 3.2479 3.7722 3.5959 3.7910 3.7720 3.8010 3.8319 4.0342 3.9292 3.8708 3.9239 3.9250 3.9261 3.9173 4.2874 3.9022 3.8921 3.8912 3.6607 3.9075 4.0145 3.8779 3.8779 3.9018 1.0400 1.0364 1.0172 0.9963 1.0375 1.0037 1.0141 1.0035 1.0024 1.0032 1.0032 1.0035 1.0033 1.0030 1.0055 1.0143 1.0025 1.0049 1.0002 0.9971 1.0069 1.0029 1.0356 1.0069 1.0073 1.0363 1.0022 0.9973 1.0080 0.9890 0.9881 0.9894
dispcorr: -0.034429572 hartree
energy: -1478.814228006621
dipole: -14.76017 17.17373 2.41356 0.03918 -0.22695 -0.18777 9.78122 -8.37925 1.40197
magnitude: 2.79751 au
magnitude: 7.11070 debye
