program: Orca
programVersion: 5.0.2
elementType: S O N N C C C C C C C C C C C C C C C C C C C C C C C H H H H H H H H H H H H H H H H H H H H H H H H H H H H H H H H
charge: 0
multiplicity: 1
keywords: wb97x-d3
keywords: def2-TZVPP
keywords: def2/J RIJCOSX
keywords: DEFGRID2
keywords: scfconv7
keywords: smallprint printgap noloewdin
keywords: NOSOSCF
formula: C23H32N2OS
InChI: InChI=1/C23H32N2OS/c1-15(2)19-13-18(26-17-11-9-8-10-12-17)14-20(16(3)4)21(19)24-22(27)25-23(5,6)7/h8-16,24-25H,1-7H3
59 atoms
S  -4.412635 0.680199 -1.201432
O  3.301903 -1.349349 -0.048731
N  -1.897421 0.023081 -1.424943
N  -2.543524 0.407997 0.723817
C  0.454281 0.64504 -1.250658
C  -0.280742 -1.58187 -0.56976
C  -0.563267 -0.304925 -1.073565
C  0.230829 2.039844 -1.804579
C  -1.346756 -2.641297 -0.395967
C  -3.357799 0.724692 1.90799
C  1.754743 0.296888 -0.908322
C  1.027891 -1.888212 -0.2124
C  2.03318 -0.954799 -0.378123
C  -0.279418 2.054645 -3.245086
C  -0.630005 2.925064 -0.903226
C  -1.088555 -3.822583 -1.330132
C  -1.444687 -3.105561 1.05625
C  -2.885329 0.360082 -0.563749
C  -3.910978 2.145979 1.836302
C  -2.39931 0.624539 3.093089
C  -4.477862 -0.295756 2.091888
C  4.204279 -0.439253 0.446096
C  3.852511 0.501872 1.406291
C  5.511904 -0.536878 -0.006258
C  4.825142 1.358595 1.900825
C  6.477258 0.317891 0.507899
C  6.13815 1.272678 1.456365
H  1.222796 2.498745 -1.826334
H  -2.312036 -2.216904 -0.673385
H  2.548594 1.018514 -1.056989
H  1.270587 -2.863712 0.192261
H  -2.161591 0.014213 -2.397666
H  -0.198089 3.063882 -3.651883
H  -1.326593 1.763948 -3.3249
H  0.305551 1.394605 -3.886434
H  -0.546157 3.963666 -1.22745
H  -0.303461 2.880202 0.136521
H  -1.686741 2.663975 -0.942875
H  -1.889416 -4.55835 -1.241289
H  -1.044258 -3.505333 -2.372744
H  -0.149932 -4.326747 -1.09311
H  -0.542233 -3.63005 1.375071
H  -1.600774 -2.267618 1.737443
H  -2.283062 -3.79306 1.177118
H  -1.572547 0.214335 0.931728
H  -4.426452 2.386907 2.767277
H  -4.616312 2.261506 1.01617
H  -3.105277 2.870325 1.702797
H  -1.580008 1.341335 3.006208
H  -1.970552 -0.376709 3.175113
H  -2.930002 0.83599 4.020701
H  -5.023846 -0.083329 3.012285
H  -4.072161 -1.306567 2.168889
H  -5.183605 -0.270511 1.263941
H  2.835375 0.570233 1.770746
H  5.771784 -1.277825 -0.751509
H  4.551724 2.093525 2.6465
H  7.496984 0.240024 0.154363
H  6.8910 1.942913 1.849074
elementType: S O N C H
totalener: -1478.77791469 hartree
nucrepener: 2745.51057888 hartree
electener: -4224.28849357 hartree
oneelecener: -7473.70577598 hartree
twoeener: 3249.41728240 hartree
cpcmener: -0.03152621 hartree
kineticenergy: 1473.01769160 hartree
xcener: -128.082998662069 hartree
chargesum: 0.0000000
charge: -0.516364 -0.341929 -0.123384 -0.078398 0.035294 -0.029431 -0.038688 0.061080 0.068820 0.202502 -0.154245 -0.181788 0.236836 -0.294411 -0.304504 -0.297037 -0.297870 0.104658 -0.315468 -0.318800 -0.324698 0.295170 -0.200429 -0.255752 -0.145147 -0.124618 -0.190084 0.042352 0.036486 0.135456 0.130071 0.169533 0.101229 0.072424 0.100304 0.109234 0.100408 0.066855 0.098123 0.099798 0.088768 0.097038 0.078319 0.103233 0.176870 0.100553 0.099708 0.095942 0.109723 0.117688 0.102284 0.101116 0.098423 0.101111 0.160981 0.148255 0.162813 0.161640 0.161946
qa: -0.5164 -0.3419 -0.1234 -0.0784 0.0353 -0.0294 -0.0387 0.0611 0.0688 0.2025 -0.1542 -0.1818 0.2368 -0.2944 -0.3045 -0.2970 -0.2979 0.1047 -0.3155 -0.3188 -0.3247 0.2952 -0.2004 -0.2558 -0.1451 -0.1246 -0.1901 0.0424 0.0365 0.1355 0.1301 0.1695 0.1012 0.0724 0.1003 0.1092 0.1004 0.0669 0.0981 0.0998 0.0888 0.0970 0.0783 0.1032 0.1769 0.1006 0.0997 0.0959 0.1097 0.1177 0.1023 0.1011 0.0984 0.1011 0.1610 0.1483 0.1628 0.1616 0.1619
va: 1.8793 2.0688 3.1784 3.2212 3.7133 3.7687 3.8391 3.8237 3.7878 3.8289 3.8455 4.0279 3.8194 3.9201 3.9374 3.9255 3.9168 4.2910 3.8821 3.9006 3.8959 3.6713 3.9056 4.0133 3.8822 3.8779 3.9004 1.0172 1.0369 1.0056 1.0186 1.0306 1.0012 1.0164 1.0033 1.0051 1.0039 1.0144 1.0021 1.0031 1.0034 1.0063 1.0127 1.0012 1.0027 1.0087 1.0384 1.0059 1.0038 0.9950 1.0074 1.0072 1.0018 1.0359 0.9963 1.0076 0.9892 0.9879 0.9893
dispcorr: -0.035334867 hartree
energy: -1478.813249556334
dipole: -16.20749 18.78307 2.57558 2.80315 -2.74702 0.05613 9.29493 -7.87552 1.41941
magnitude: 2.94134 au
magnitude: 7.47629 debye
