program: Orca
programVersion: 5.0.2
elementType: S O N N C C C C C C C C C C C C C C C C C C C C C C C H H H H H H H H H H H H H H H H H H H H H H H H H H H H H H H H
charge: 0
multiplicity: 1
keywords: wb97x-d3
keywords: def2-TZVPP
keywords: def2/J RIJCOSX
keywords: DEFGRID2
keywords: scfconv7
keywords: smallprint printgap noloewdin
keywords: NOSOSCF
formula: C23H32N2OS
InChI: InChI=1/C23H32N2OS/c1-15(2)19-13-18(26-17-11-9-8-10-12-17)14-20(16(3)4)21(19)24-22(27)25-23(5,6)7/h8-16,24-25H,1-7H3
59 atoms
S  -4.428836 0.449832 -1.568351
O  3.091633 -1.209791 0.776131
N  -1.865199 -0.043516 -1.429126
N  -2.819255 0.37525 0.592675
C  0.292918 0.730248 -0.60514
C  -0.245099 -1.650437 -0.57367
C  -0.592868 -0.323457 -0.86471
C  -0.066557 2.173852 -0.87935
C  -1.210804 -2.796171 -0.78462
C  -3.797075 0.686724 1.647081
C  1.540297 0.44186 -0.062423
C  1.012172 -1.908748 -0.043533
C  1.894262 -0.870137 0.205216
C  -0.034939 3.004747 0.402291
C  0.851622 2.773767 -1.942974
C  -0.596759 -3.92571 -1.607708
C  -1.716291 -3.311964 0.562832
C  -2.983772 0.253541 -0.724704
C  -4.899204 -0.366621 1.712747
C  -4.380295 2.084679 1.460111
C  -3.001685 0.646165 2.950609
C  4.207002 -0.443026 0.536235
C  4.582181 -0.090922 -0.754325
C  4.984087 -0.083855 1.626864
C  5.74765 0.636787 -0.943811
C  6.154325 0.634736 1.42126
C  6.537499 1.002743 0.13954
H  -1.084856 2.207324 -1.268432
H  -2.072848 -2.421421 -1.338651
H  2.228801 1.250009 0.152804
H  1.310836 -2.923497 0.191162
H  -2.010666 -0.215511 -2.412816
H  0.973579 3.077504 0.813823
H  -0.68046 2.579818 1.173235
H  -0.38132 4.020083 0.203116
H  0.809777 2.206502 -2.87376
H  1.891599 2.797196 -1.611448
H  0.553894 3.799586 -2.166566
H  -1.344444 -4.696429 -1.801007
H  -0.232956 -3.567945 -2.571718
H  0.23677 -4.405352 -1.091876
H  -0.901568 -3.725569 1.160599
H  -2.187497 -2.51804 1.144924
H  -2.456118 -4.10099 0.418257
H  -1.883461 0.207963 0.938954
H  -5.50075 -0.379268 0.806089
H  -5.557145 -0.155877 2.557132
H  -4.474978 -1.362092 1.859002
H  -5.0601 2.314415 2.282221
H  -4.934257 2.165664 0.526501
H  -3.590465 2.838406 1.458916
H  -2.567106 -0.341601 3.119706
H  -3.653599 0.872149 3.793636
H  -2.192436 1.379969 2.947275
H  3.977907 -0.381862 -1.604586
H  4.679551 -0.367877 2.626149
H  6.041872 0.91235 -1.948042
H  6.763154 0.912622 2.271791
H  7.4469 1.567463 -0.016141
elementType: S O N C H
totalener: -1478.77989678 hartree
nucrepener: 2729.53255034 hartree
electener: -4208.31244711 hartree
oneelecener: -7441.81809219 hartree
twoeener: 3233.50564508 hartree
cpcmener: -0.03139467 hartree
kineticenergy: 1473.01160678 hartree
xcener: -128.080521385920 hartree
chargesum: -0.0000000
charge: -0.524593 -0.343768 -0.166184 -0.123162 0.091119 -0.001480 -0.016410 0.045959 0.066525 0.201825 -0.199015 -0.217091 0.209519 -0.281340 -0.293350 -0.292638 -0.281488 0.187193 -0.319836 -0.314315 -0.319948 0.278759 -0.192947 -0.241059 -0.147638 -0.131373 -0.182177 0.042574 0.033022 0.146390 0.132399 0.162251 0.090947 0.079320 0.100508 0.099934 0.085090 0.096735 0.097082 0.099144 0.085295 0.092963 0.073258 0.099244 0.177122 0.099182 0.100427 0.098293 0.099257 0.099804 0.096619 0.110612 0.104327 0.113243 0.159012 0.148594 0.162319 0.161724 0.162226
qa: -0.5246 -0.3438 -0.1662 -0.1232 0.0911 -0.0015 -0.0164 0.0460 0.0665 0.2018 -0.1990 -0.2171 0.2095 -0.2813 -0.2933 -0.2926 -0.2815 0.1872 -0.3198 -0.3143 -0.3199 0.2788 -0.1929 -0.2411 -0.1476 -0.1314 -0.1822 0.0426 0.0330 0.1464 0.1324 0.1623 0.0909 0.0793 0.1005 0.0999 0.0851 0.0967 0.0971 0.0991 0.0853 0.0930 0.0733 0.0992 0.1771 0.0992 0.1004 0.0983 0.0993 0.0998 0.0966 0.1106 0.1043 0.1132 0.1590 0.1486 0.1623 0.1617 0.1622
va: 1.8634 2.0650 3.1965 3.2497 3.5995 3.7912 3.7884 3.8067 3.7693 3.8268 3.9103 4.0331 3.8736 3.9165 3.9267 3.9238 3.9241 4.2827 3.8934 3.8892 3.9042 3.6793 3.9079 4.0079 3.8817 3.8804 3.8931 1.0351 1.0418 0.9972 1.0163 1.0382 1.0056 1.0139 1.0027 1.0031 1.0036 1.0031 1.0023 1.0030 1.0032 1.0039 1.0158 1.0036 1.0034 1.0368 1.0072 1.0002 1.0070 1.0363 1.0040 0.9994 1.0064 0.9983 0.9964 1.0068 0.9893 0.9882 0.9890
dispcorr: -0.034561119 hartree
energy: -1478.814457894862
dipole: -14.51980 16.98519 2.46540 3.69823 -3.60429 0.09394 9.59596 -8.21647 1.37950
magnitude: 2.82666 au
magnitude: 7.18481 debye
