program: Orca
programVersion: 5.0.2
elementType: S O N N C C C C C C C C C C C C C C C C C C C C C C C H H H H H H H H H H H H H H H H H H H H H H H H H H H H H H H H
charge: 0
multiplicity: 1
keywords: wb97x-d3
keywords: def2-TZVPP
keywords: def2/J RIJCOSX
keywords: DEFGRID2
keywords: scfconv7
keywords: smallprint printgap noloewdin
keywords: NOSOSCF
formula: C23H32N2OS
InChI: InChI=1/C23H32N2OS/c1-15(2)19-13-18(26-17-11-9-8-10-12-17)14-20(16(3)4)21(19)24-22(27)25-23(5,6)7/h8-16,24-25H,1-7H3
59 atoms
S  -4.475523 -0.111504 -1.516536
O  3.240217 0.796411 0.625845
N  -1.873983 0.116206 -1.411724
N  -2.874379 0.174869 0.631656
C  0.002853 1.54865 -0.80989
C  0.15018 -0.862943 -0.465707
C  -0.56338 0.267834 -0.886295
C  -0.752386 2.78986 -1.230505
C  -0.428825 -2.258436 -0.539239
C  -3.881778 0.132384 1.703163
C  1.29368 1.677695 -0.315143
C  1.435657 -0.69924 0.038922
C  2.002409 0.563249 0.103248
C  -1.105462 3.639118 -0.009277
C  0.026662 3.608531 -2.257283
C  0.405508 -3.14367 -1.464196
C  -0.553897 -2.882658 0.849851
C  -3.02007 0.070089 -0.690798
C  -3.086635 0.277249 2.999838
C  -4.618699 -1.205446 1.719696
C  -4.864877 1.29497 1.587529
C  4.246167 -0.124181 0.515359
C  4.498697 -0.814651 -0.664216
C  5.065736 -0.291797 1.622676
C  5.577434 -1.685434 -0.720174
C  6.148449 -1.155876 1.547551
C  6.405695 -1.86112 0.380293
H  -1.68734 2.480676 -1.700507
H  -1.431166 -2.19555 -0.965218
H  1.760419 2.653195 -0.245397
H  1.989913 -1.564393 0.382282
H  -1.995342 0.048713 -2.410966
H  -0.209829 4.018983 0.486643
H  -1.676047 3.06748 0.724354
H  -1.711621 4.498173 -0.302197
H  -0.568856 4.459815 -2.591362
H  0.278297 3.015598 -3.13788
H  0.95608 4.0059 -1.845283
H  1.415321 -3.296422 -1.077701
H  -0.056636 -4.126789 -1.56962
H  0.492728 -2.710825 -2.461931
H  0.42128 -3.032012 1.317344
H  -1.152397 -2.260107 1.517299
H  -1.039058 -3.858226 0.785648
H  -1.926521 0.294992 0.963292
H  -2.540549 1.222972 3.03265
H  -2.365725 -0.535337 3.118973
H  -3.757302 0.253173 3.858093
H  -3.91646 -2.038089 1.793693
H  -5.219009 -1.344774 0.822734
H  -5.283185 -1.249995 2.584215
H  -5.533861 1.300998 2.449733
H  -5.471935 1.218172 0.687549
H  -4.33937 2.251621 1.565946
H  3.868881 -0.676714 -1.534256
H  4.8604 0.258938 2.532285
H  5.77389 -2.224385 -1.63815
H  6.789716 -1.279511 2.410759
H  7.248023 -2.538137 0.325749
elementType: S O N C H
totalener: -1478.79710725 hartree
nucrepener: 2722.47983114 hartree
electener: -4201.27693839 hartree
oneelecener: -7427.72841349 hartree
twoeener: 3226.45147510 hartree
cpcmener: -0.02700952 hartree
kineticenergy: 1473.00905732 hartree
xcener: -128.080062485887 hartree
chargesum: -0.0000000
charge: -0.511350 -0.329111 -0.170985 -0.126016 0.024570 0.078876 -0.023633 0.049222 0.046200 0.192104 -0.208550 -0.213478 0.212451 -0.277753 -0.290463 -0.290784 -0.277377 0.190419 -0.313977 -0.313082 -0.311569 0.299718 -0.207616 -0.256194 -0.139050 -0.118584 -0.187806 0.039732 0.040286 0.128758 0.145215 0.163493 0.089816 0.077130 0.098547 0.096953 0.099044 0.084759 0.083538 0.097653 0.100070 0.092140 0.073160 0.100574 0.171866 0.109114 0.111731 0.101869 0.095803 0.102685 0.098280 0.097687 0.101415 0.095963 0.155500 0.145620 0.159469 0.157726 0.158224
qa: -0.5114 -0.3291 -0.1710 -0.1260 0.0246 0.0789 -0.0236 0.0492 0.0462 0.1921 -0.2086 -0.2135 0.2125 -0.2778 -0.2905 -0.2908 -0.2774 0.1904 -0.3140 -0.3131 -0.3116 0.2997 -0.2076 -0.2562 -0.1391 -0.1186 -0.1878 0.0397 0.0403 0.1288 0.1452 0.1635 0.0898 0.0771 0.0985 0.0970 0.0990 0.0848 0.0835 0.0977 0.1001 0.0921 0.0732 0.1006 0.1719 0.1091 0.1117 0.1019 0.0958 0.1027 0.0983 0.0977 0.1014 0.0960 0.1555 0.1456 0.1595 0.1577 0.1582
va: 1.8790 2.0862 3.1862 3.2392 3.7402 3.6138 3.7918 3.7811 3.8065 3.8448 4.0293 3.9196 3.8989 3.9254 3.9259 3.9264 3.9186 4.2869 3.9012 3.8902 3.8903 3.6785 3.9117 4.0169 3.8833 3.8840 3.9084 1.0385 1.0376 1.0180 0.9971 1.0383 1.0038 1.0147 1.0039 1.0028 1.0033 1.0035 1.0039 1.0035 1.0033 1.0056 1.0157 1.0029 1.0076 1.0009 0.9978 1.0076 1.0029 1.0358 1.0071 1.0072 1.0358 1.0031 0.9981 1.0089 0.9901 0.9893 0.9906
dispcorr: -0.034266371 hartree
energy: -1478.831373619953
dipole: -14.76367 17.11385 2.35018 0.13049 -0.30085 -0.17037 9.57899 -8.25757 1.32143
magnitude: 2.70158 au
magnitude: 6.86686 debye
