program: Orca
programVersion: 5.0.2
elementType: S O N N C C C C C C C C C C C C C C C C C C C C C C C H H H H H H H H H H H H H H H H H H H H H H H H H H H H H H H H
charge: 0
multiplicity: 1
keywords: wb97x-d3
keywords: def2-TZVPP
keywords: def2/J RIJCOSX
keywords: DEFGRID2
keywords: scfconv7
keywords: smallprint printgap noloewdin
keywords: NOSOSCF
formula: C23H32N2OS
InChI: InChI=1/C23H32N2OS/c1-15(2)19-13-18(26-17-11-9-8-10-12-17)14-20(16(3)4)21(19)24-22(27)25-23(5,6)7/h8-16,24-25H,1-7H3
59 atoms
S  -4.492123 0.531285 -0.985037
O  3.317311 -1.328782 -0.263486
N  -2.022132 -0.250845 -1.316658
N  -2.501389 0.350393 0.825048
C  0.256822 0.554138 -1.023676
C  -0.226771 -1.83059 -0.823911
C  -0.653677 -0.511244 -1.045024
C  -0.163079 1.984047 -1.289315
C  -1.138811 -3.042727 -0.868059
C  -3.22082 0.774978 2.036516
C  1.598048 0.297265 -0.755519
C  1.115914 -2.049944 -0.548231
C  2.018222 -0.996729 -0.50496
C  0.129189 2.878542 -0.08539
C  0.506815 2.526393 -2.550958
C  -2.151658 -3.090069 0.275868
C  -1.822852 -3.24876 -2.219609
C  -2.935905 0.207361 -0.42825
C  -2.188065 0.699072 3.159509
C  -4.374059 -0.172316 2.361217
C  -3.710451 2.215112 1.90726
C  4.186222 -0.433453 0.300244
C  5.453377 -0.347097 -0.2575
C  3.85507 0.308887 1.427902
C  6.39971 0.487055 0.321128
C  4.806361 1.149953 1.98668
C  6.079405 1.243772 1.439378
H  -1.239494 2.005288 -1.46362
H  -0.476768 -3.901604 -0.726319
H  2.307727 1.115642 -0.75148
H  1.471814 -3.057109 -0.365188
H  -2.352908 -0.329105 -2.266198
H  -0.262951 3.883015 -0.25382
H  1.200912 2.97234 0.101015
H  -0.333608 2.49172 0.824133
H  0.280015 1.909277 -3.421701
H  1.592643 2.572496 -2.447516
H  0.154465 3.537635 -2.762065
H  -1.678522 -2.909584 1.242293
H  -2.959912 -2.371292 0.150838
H  -2.609149 -4.080339 0.318252
H  -2.633006 -2.540952 -2.392975
H  -1.116095 -3.166723 -3.04675
H  -2.258895 -4.248579 -2.262106
H  -1.540223 0.082657 0.990387
H  -2.638181 1.003989 4.103911
H  -1.33845 1.358856 2.967945
H  -1.80745 -0.317254 3.285864
H  -4.019433 -1.200104 2.460188
H  -5.143437 -0.147939 1.592016
H  -4.83164 0.115027 3.309347
H  -4.449709 2.31838 1.11507
H  -2.880068 2.890372 1.691064
H  -4.168596 2.537486 2.843783
H  5.698192 -0.935841 -1.132759
H  2.870003 0.235067 1.871696
H  7.389913 0.547199 -0.111798
H  4.548476 1.730733 2.862984
H  6.81712 1.897834 1.885311
elementType: S O N C H
totalener: -1478.79448745 hartree
nucrepener: 2749.77034988 hartree
electener: -4228.56483733 hartree
oneelecener: -7482.29029171 hartree
twoeener: 3253.72545438 hartree
cpcmener: -0.02689166 hartree
kineticenergy: 1473.00611435 hartree
xcener: -128.080273187557 hartree
chargesum: -0.0000000
charge: -0.501644 -0.326780 -0.130816 -0.080202 0.017886 0.046606 -0.059595 0.054150 0.065599 0.191254 -0.198323 -0.189493 0.244779 -0.281760 -0.293139 -0.308549 -0.296109 0.102360 -0.314231 -0.314430 -0.314023 0.299767 -0.250880 -0.212230 -0.119471 -0.136931 -0.186026 0.037946 0.042861 0.146474 0.124171 0.169234 0.102576 0.089669 0.074442 0.099783 0.087324 0.097635 0.100216 0.070872 0.107995 0.074245 0.100653 0.100069 0.173056 0.101952 0.111685 0.107716 0.094944 0.102804 0.100674 0.101621 0.095808 0.098948 0.145464 0.155790 0.157785 0.159388 0.158432
qa: -0.5016 -0.3268 -0.1308 -0.0802 0.0179 0.0466 -0.0596 0.0541 0.0656 0.1913 -0.1983 -0.1895 0.2448 -0.2818 -0.2931 -0.3085 -0.2961 0.1024 -0.3142 -0.3144 -0.3140 0.2998 -0.2509 -0.2122 -0.1195 -0.1369 -0.1860 0.0379 0.0429 0.1465 0.1242 0.1692 0.1026 0.0897 0.0744 0.0998 0.0873 0.0976 0.1002 0.0709 0.1080 0.0742 0.1007 0.1001 0.1731 0.1020 0.1117 0.1077 0.0949 0.1028 0.1007 0.1016 0.0958 0.0989 0.1455 0.1558 0.1578 0.1594 0.1584
va: 1.8970 2.0885 3.1768 3.2089 3.7072 3.7310 3.8488 3.8052 3.7989 3.8467 3.9109 4.0057 3.8396 3.9150 3.9266 3.9477 3.9152 4.2998 3.9016 3.8806 3.8928 3.6764 4.0182 3.9206 3.8802 3.8816 3.9076 1.0398 1.0159 0.9967 1.0187 1.0303 1.0028 1.0073 1.0150 1.0037 1.0032 1.0024 1.0030 1.0074 1.0060 1.0178 1.0026 1.0026 1.0053 1.0079 0.9984 1.0040 1.0052 1.0381 1.0088 1.0368 1.0019 1.0073 1.0084 0.9981 0.9892 0.9900 0.9904
dispcorr: -0.035575461 hartree
energy: -1478.830062913129
dipole: -14.85907 17.44368 2.58461 5.71391 -5.69240 0.02151 9.49105 -8.21365 1.27740
magnitude: 2.88313 au
magnitude: 7.32833 debye
