program: Orca
programVersion: 5.0.2
elementType: Cl S O O N N C C C C C C C C C C C C C C C C C H H H H H H H H H H H H H H H H H H H H H
charge: 0
multiplicity: 1
keywords: wb97x-d3
keywords: def2-TZVPP
keywords: def2/J RIJCOSX
keywords: DEFGRID2
keywords: scfconv7
keywords: smallprint printgap noloewdin
keywords: NOSOSCF
formula: C17H21ClN2O2S
InChI: InChI=1/C17H21ClN2O2S/c1-11-15(12-7-9-13(18)10-8-12)23-17(22)20(11)16(21)19-14-5-3-2-4-6-14/h7-11,14-15,19H,2-6H2,1H3
44 atoms
Cl -5.504048 -2.804238 -0.105904
S  -1.171768 2.353989 1.423587
O  1.641341 0.309445 -1.916804
O  1.175903 1.399081 2.056476
N  2.532422 0.035087 0.148497
N  0.533661 1.214389 -0.157455
C  3.703496 -0.726369 -0.251123
C  4.966946 0.12679 -0.154097
C  3.821563 -1.983419 0.607682
C  6.210849 -0.679693 -0.511401
C  5.06717 -2.785192 0.246398
C  6.327332 -1.934018 0.347162
C  -0.484957 1.745799 -1.07047
C  -1.770368 1.910552 -0.24373
C  1.619637 0.490761 -0.710064
C  -0.039298 3.059113 -1.690001
C  0.38588 1.571077 1.155665
C  -2.677779 0.71356 -0.204042
C  -2.208152 -0.570302 0.068323
C  -4.036614 0.886179 -0.440832
C  -3.071069 -1.652391 0.093684
C  -4.916783 -0.185995 -0.409354
C  -4.422909 -1.451278 -0.1438
H  3.56535 -1.030434 -1.290243
H  5.060033 0.510424 0.868227
H  4.873149 0.995693 -0.810369
H  2.924429 -2.595191 0.485372
H  3.867507 -1.694835 1.664395
H  7.100577 -0.055914 -0.398291
H  6.167043 -0.965943 -1.567821
H  4.968015 -3.168111 -0.774952
H  5.144198 -3.659469 0.896893
H  7.20171 -2.517164 0.047943
H  6.488946 -1.646274 1.391732
H  -0.667755 1.012653 -1.853791
H  2.453214 0.288301 1.124521
H  -2.32659 2.765789 -0.62822
H  0.894529 2.936328 -2.236547
H  -0.792286 3.411185 -2.395295
H  0.106076 3.831726 -0.933349
H  -1.159663 -0.752497 0.266027
H  -4.424934 1.875165 -0.65266
H  -2.689209 -2.642658 0.302244
H  -5.971151 -0.028019 -0.592407
elementType: Cl S O N C H
totalener: -1779.01462367 hartree
nucrepener: 2215.39043678 hartree
electener: -3994.40506045 hartree
oneelecener: -6840.93156610 hartree
twoeener: 2846.52650565 hartree
cpcmener: -0.02614142 hartree
kineticenergy: 1773.55474664 hartree
xcener: -130.410051250416 hartree
chargesum: -0.0000000
charge: -0.095208 -0.055942 -0.532214 -0.443004 -0.245050 -0.117673 0.108260 -0.155754 -0.155944 -0.143737 -0.143406 -0.129599 0.061191 0.135485 0.421219 -0.277601 0.283695 -0.006157 -0.199538 -0.238622 -0.151013 -0.116480 0.088826 0.077677 0.074232 0.081870 0.081171 0.076611 0.074535 0.070344 0.070063 0.075444 0.078427 0.063488 0.098680 0.188258 0.131006 0.098578 0.099525 0.091979 0.151236 0.140590 0.141764 0.142788
qa: -0.0952 -0.0559 -0.5322 -0.4430 -0.2451 -0.1177 0.1083 -0.1558 -0.1559 -0.1437 -0.1434 -0.1296 0.0612 0.1355 0.4212 -0.2776 0.2837 -0.0062 -0.1995 -0.2386 -0.1510 -0.1165 0.0888 0.0777 0.0742 0.0819 0.0812 0.0766 0.0745 0.0703 0.0701 0.0754 0.0784 0.0635 0.0987 0.1883 0.1310 0.0986 0.0995 0.0920 0.1512 0.1406 0.1418 0.1428
va: 1.2088 2.3749 1.9804 2.0571 3.2459 3.1592 3.7839 3.9297 3.9340 3.9036 3.9035 3.8868 3.9280 3.6900 4.2587 3.9686 4.2873 3.6309 3.9790 4.0594 4.0319 3.9588 3.8340 1.0442 1.0167 1.0167 1.0165 1.0152 1.0122 1.0092 1.0095 1.0118 1.0096 1.0109 1.0228 1.0452 1.0068 1.0180 1.0051 1.0081 1.0040 1.0057 1.0084 1.0059
dispcorr: -0.022381082 hartree
energy: -1779.037004755376
dipole: 47.60595 -47.62477 -0.01883 0.78490 -0.12273 0.66217 -6.39429 6.01816 -0.37613
magnitude: 0.76177 au
magnitude: 1.93627 debye
