program: Orca
programVersion: 5.0.2
elementType: F F O O N C C C C C C C C C C C C C C C C C C C C C H H H H H H H H H H H H H H H H H H H H H H H
charge: 0
multiplicity: 1
keywords: wb97x-d3
keywords: def2-TZVPP
keywords: def2/J RIJCOSX
keywords: DEFGRID2
keywords: scfconv7
keywords: smallprint printgap noloewdin
keywords: NOSOSCF
formula: C21H23F2NO2
InChI: InChI=1/C21H23F2NO2/c1-5-25-18-11-13(21(2,3)4)9-10-14(18)17-12-26-20(24-17)19-15(22)7-6-8-16(19)23/h6-11,17H,5,12H2,1-4H3
49 atoms
F  2.566696 2.286635 -0.550542
F  4.679148 -1.751592 0.552656
O  2.006345 -1.313115 0.957457
O  -2.091575 -2.465132 -0.300154
N  1.39557 -0.344825 -0.974697
C  -4.701116 1.709334 0.45448
C  -3.409792 0.946333 0.172568
C  0.271477 -1.198452 -0.612298
C  -0.992632 -0.41783 -0.358684
C  -4.549043 2.501508 1.758247
C  -5.909098 0.78479 0.595755
C  -4.975003 2.681638 -0.699154
C  -3.382666 -0.441852 0.051703
C  -2.193968 -1.117645 -0.208018
C  -2.209552 1.638168 0.02529
C  0.767955 -1.966614 0.633298
C  -1.025849 0.962537 -0.234774
C  2.261088 -0.469541 -0.056355
C  3.551092 0.229848 0.007914
C  -3.259367 -3.279951 -0.329742
C  3.665898 1.592811 -0.250388
C  4.730182 -0.436241 0.331804
C  -3.985468 -3.220937 -1.655985
C  4.867285 2.267346 -0.182594
C  5.953385 0.194803 0.404906
C  6.010104 1.55582 0.147642
H  0.093194 -1.895227 -1.433401
H  -4.354608 1.839577 2.604089
H  -5.465732 3.054575 1.973562
H  -3.734701 3.225354 1.706696
H  -5.797364 0.080554 1.422295
H  -6.098206 0.211307 -0.31367
H  -6.80251 1.378778 0.794814
H  -5.89483 3.240484 -0.513877
H  -5.095057 2.150469 -1.645257
H  -4.170146 3.407461 -0.82303
H  -4.299495 -1.0019 0.163724
H  -2.185079 2.717312 0.109793
H  0.105618 -1.895464 1.494588
H  0.973403 -3.017097 0.42491
H  -0.109207 1.527619 -0.341546
H  -2.893413 -4.290656 -0.151446
H  -3.925512 -3.032797 0.50133
H  -3.326022 -3.503904 -2.476755
H  -4.39564 -2.233978 -1.869568
H  -4.817226 -3.925878 -1.638913
H  4.905049 3.329679 -0.381019
H  6.842002 -0.36925 0.653177
H  6.959523 2.069694 0.203577
elementType: F O N C H
totalener: -1219.08889262 hartree
nucrepener: 2325.96951362 hartree
electener: -3545.05840624 hartree
oneelecener: -6287.69086972 hartree
twoeener: 2742.63246348 hartree
cpcmener: -0.02817835 hartree
kineticenergy: 1213.90701399 hartree
xcener: -115.860458163874 hartree
chargesum: 0.0000000
charge: -0.201973 -0.205558 -0.330426 -0.348997 -0.383972 0.328449 -0.128050 0.178023 -0.116897 -0.330713 -0.365050 -0.329985 -0.183438 0.257217 -0.251877 0.042771 -0.169218 0.366950 -0.186119 0.030842 0.286917 0.310008 -0.261202 -0.238326 -0.257288 -0.055582 0.084396 0.102252 0.096866 0.097570 0.103460 0.101445 0.103261 0.096523 0.102168 0.097351 0.137200 0.138057 0.092596 0.095453 0.150903 0.106425 0.087019 0.088834 0.091672 0.096027 0.153168 0.152176 0.168673
qa: -0.2020 -0.2056 -0.3304 -0.3490 -0.3840 0.3284 -0.1281 0.1780 -0.1169 -0.3307 -0.3650 -0.3300 -0.1834 0.2572 -0.2519 0.0428 -0.1692 0.3669 -0.1861 0.0308 0.2869 0.3100 -0.2612 -0.2383 -0.2573 -0.0556 0.0844 0.1023 0.0969 0.0976 0.1035 0.1014 0.1033 0.0965 0.1022 0.0974 0.1372 0.1381 0.0926 0.0955 0.1509 0.1064 0.0870 0.0888 0.0917 0.0960 0.1532 0.1522 0.1687
va: 1.0945 1.0882 2.1137 2.0587 3.0155 3.6247 3.7839 3.9341 3.6835 3.9148 3.9325 3.9170 3.8460 3.9346 4.0707 3.8988 3.9689 3.9950 3.4834 3.8801 3.9373 3.9312 3.9136 3.9850 3.9647 3.8145 1.0130 1.0033 1.0036 1.0043 1.0001 1.0001 1.0077 1.0041 1.0028 1.0042 0.9960 1.0057 0.9979 0.9992 1.0079 0.9915 0.9946 1.0055 1.0023 1.0091 1.0025 1.0026 0.9839
dispcorr: -0.023463971 hartree
energy: -1219.112356592576
dipole: -56.86723 56.43310 -0.43414 2.20166 -2.57850 -0.37684 0.58518 -0.01903 0.56615
magnitude: 0.80685 au
magnitude: 2.05085 debye
