program: Orca
programVersion: 5.0.2
elementType: F F O O N C C C C C C C C C C C C C C C C C C C C C H H H H H H H H H H H H H H H H H H H H H H H
charge: 0
multiplicity: 1
keywords: wb97x-d3
keywords: def2-TZVPP
keywords: def2/J RIJCOSX
keywords: DEFGRID2
keywords: scfconv7
keywords: smallprint printgap noloewdin
keywords: NOSOSCF
formula: C21H23F2NO2
InChI: InChI=1/C21H23F2NO2/c1-5-25-18-11-13(21(2,3)4)9-10-14(18)17-12-26-20(24-17)19-15(22)7-6-8-16(19)23/h6-11,17H,5,12H2,1-4H3
49 atoms
F  4.518525 -0.791796 -1.849425
F  1.949757 0.627647 1.79429
O  1.717656 -1.028518 -1.682834
O  -0.450317 -0.936785 0.236716
N  1.275319 1.084554 -1.051641
C  -4.995627 0.896753 0.823132
C  -3.658909 0.874001 0.087999
C  0.169405 0.710519 -1.939539
C  -1.155252 0.739189 -1.221437
C  -4.763124 1.243493 2.298796
C  -5.651116 -0.486317 0.724767
C  -5.959237 1.926593 0.236242
C  -2.668659 -0.017557 0.511843
C  -1.437505 -0.094075 -0.126305
C  -3.377994 1.694591 -0.996553
C  0.600863 -0.655568 -2.504391
C  -2.14183 1.620203 -1.629295
C  2.013384 0.058931 -0.951209
C  3.180702 -0.078062 -0.070562
C  -0.607174 -1.827097 1.33514
C  4.406788 -0.530888 -0.544521
C  3.110556 0.209184 1.287882
C  -1.394896 -3.067928 0.975206
C  5.509497 -0.6978 0.265264
C  4.185449 0.053769 2.138936
C  5.384683 -0.403362 1.614981
H  0.107271 1.438823 -2.748625
H  -5.713524 1.262862 2.836252
H  -4.300455 2.226237 2.407164
H  -4.121296 0.515903 2.797435
H  -5.034058 -1.266981 1.17248
H  -5.83759 -0.763496 -0.314443
H  -6.610403 -0.48842 1.24655
H  -5.566289 2.942738 0.301928
H  -6.899302 1.90552 0.789883
H  -6.193648 1.72203 -0.809839
H  -2.878166 -0.662696 1.354554
H  -4.108075 2.400173 -1.366813
H  -0.160148 -1.432332 -2.448549
H  0.943003 -0.574303 -3.537422
H  -1.940633 2.272395 -2.471331
H  0.409206 -2.103931 1.6151
H  -1.04414 -1.309733 2.193632
H  -0.929392 -3.598052 0.143957
H  -2.428623 -2.849702 0.706905
H  -1.411789 -3.742515 1.831767
H  6.444588 -1.046131 -0.150953
H  4.08305 0.281222 3.191159
H  6.236811 -0.529448 2.268277
elementType: F O N C H
totalener: -1219.08926848 hartree
nucrepener: 2404.56054127 hartree
electener: -3623.64980975 hartree
oneelecener: -6445.35896867 hartree
twoeener: 2821.70915892 hartree
cpcmener: -0.03247523 hartree
kineticenergy: 1213.91646551 hartree
xcener: -115.860912493743 hartree
chargesum: 0.0000000
charge: -0.207255 -0.205218 -0.341422 -0.323028 -0.369726 0.324672 -0.118936 0.403654 -0.301109 -0.330173 -0.328434 -0.356265 -0.203345 0.271911 -0.176224 -0.018338 -0.179095 0.326276 -0.189646 0.010851 0.328827 0.263032 -0.255910 -0.267523 -0.241479 -0.055298 0.085232 0.097629 0.102353 0.096408 0.093593 0.102821 0.098450 0.100603 0.101373 0.100304 0.131439 0.144752 0.106548 0.100434 0.135716 0.098210 0.093892 0.088881 0.088732 0.096968 0.151748 0.153318 0.169797
qa: -0.2073 -0.2052 -0.3414 -0.3230 -0.3697 0.3247 -0.1189 0.4037 -0.3011 -0.3302 -0.3284 -0.3563 -0.2033 0.2719 -0.1762 -0.0183 -0.1791 0.3263 -0.1896 0.0109 0.3288 0.2630 -0.2559 -0.2675 -0.2415 -0.0553 0.0852 0.0976 0.1024 0.0964 0.0936 0.1028 0.0985 0.1006 0.1014 0.1003 0.1314 0.1448 0.1065 0.1004 0.1357 0.0982 0.0939 0.0889 0.0887 0.0970 0.1517 0.1533 0.1698
va: 1.0881 1.0874 2.0825 2.0928 3.0895 3.6468 3.8004 3.6577 3.8879 3.9182 3.9179 3.9236 3.9595 3.8567 3.8827 3.9436 4.0457 4.0590 3.5086 3.8739 3.9199 3.9725 3.9283 3.9700 3.9768 3.8031 0.9996 1.0033 1.0038 1.0033 1.0031 1.0038 1.0037 1.0012 1.0069 1.0011 1.0021 0.9978 0.9965 1.0011 1.0056 0.9929 0.9949 1.0047 1.0018 1.0088 1.0032 1.0023 0.9836
dispcorr: -0.025088651 hartree
energy: -1219.114357135249
dipole: -50.16064 50.03229 -0.12835 -3.23931 1.99574 -1.24357 10.35209 -9.48665 0.86543
magnitude: 1.52050 au
magnitude: 3.86480 debye
