program: Orca
programVersion: 5.0.2
elementType: F F O O N C C C C C C C C C C C C C C C C C C C C C H H H H H H H H H H H H H H H H H H H H H H H
charge: 0
multiplicity: 1
keywords: wb97x-d3
keywords: def2-TZVPP
keywords: def2/J RIJCOSX
keywords: DEFGRID2
keywords: scfconv7
keywords: smallprint printgap noloewdin
keywords: NOSOSCF
formula: C21H23F2NO2
InChI: InChI=1/C21H23F2NO2/c1-5-25-18-11-13(21(2,3)4)9-10-14(18)17-12-26-20(24-17)19-15(22)7-6-8-16(19)23/h6-11,17H,5,12H2,1-4H3
49 atoms
F  3.031597 -2.562435 -0.425859
F  3.731937 2.006533 0.429301
O  1.825724 -0.68602 -1.868496
O  -0.685771 -0.954316 0.252909
N  1.274624 1.028667 -0.526268
C  -5.251652 0.978497 0.528694
C  -3.815515 0.96556 0.014578
C  0.227665 0.997808 -1.547836
C  -1.164757 0.97147 -0.978693
C  -5.517146 2.299156 1.26085
C  -5.539013 -0.169979 1.494349
C  -6.21076 0.85529 -0.660884
C  -2.90037 -0.011839 0.400636
C  -1.594248 -0.017241 -0.085774
C  -3.385463 1.947728 -0.874664
C  0.590662 -0.216278 -2.42764
C  -2.084367 1.941746 -1.352382
C  2.077455 0.084962 -0.795417
C  3.284001 -0.255158 -0.029113
C  -1.015081 -1.931952 1.232904
C  3.71773 -1.569742 0.144582
C  4.058725 0.725004 0.591262
C  0.2198 -2.753254 1.504302
C  4.820502 -1.90469 0.902105
C  5.172591 0.435033 1.350762
C  5.54422 -0.890525 1.507613
H  0.307968 1.913951 -2.137772
H  -6.540875 2.322206 1.64042
H  -5.390775 3.163294 0.60737
H  -4.844595 2.421765 2.111768
H  -6.576023 -0.114593 1.829216
H  -4.90823 -0.129447 2.384323
H  -5.402008 -1.146794 1.026763
H  -7.246625 0.858203 -0.314813
H  -6.046052 -0.075702 -1.206667
H  -6.098536 1.679716 -1.366267
H  -3.211816 -0.785549 1.086732
H  -4.060852 2.727174 -1.203783
H  -0.14302 -1.021805 -2.397298
H  0.761378 0.058777 -3.467455
H  -1.769802 2.717241 -2.041312
H  -1.355307 -1.444138 2.151624
H  -1.829323 -2.569604 0.87412
H  0.565111 -3.266352 0.607506
H  -0.013878 -3.511711 2.25103
H  1.031239 -2.138858 1.895853
H  5.103215 -2.942455 1.01411
H  5.738723 1.23575 1.806546
H  6.411353 -1.135738 2.104759
elementType: F O N C H
totalener: -1219.08954970 hartree
nucrepener: 2377.85472650 hartree
electener: -3596.94427621 hartree
oneelecener: -6391.98813694 hartree
twoeener: 2795.04386073 hartree
cpcmener: -0.03177113 hartree
kineticenergy: 1213.91158700 hartree
xcener: -115.859637934408 hartree
chargesum: -0.0000000
charge: -0.204394 -0.198804 -0.328162 -0.319479 -0.376038 0.334826 -0.146824 0.304006 -0.225157 -0.329698 -0.368561 -0.330437 -0.166268 0.286407 -0.218318 0.006302 -0.166980 0.354382 -0.177642 0.035975 0.261534 0.285397 -0.292884 -0.229503 -0.251486 -0.061559 0.074574 0.097358 0.097261 0.102437 0.104203 0.102834 0.101995 0.097050 0.102114 0.097671 0.133898 0.140323 0.094167 0.101511 0.134977 0.096771 0.096855 0.088235 0.101830 0.084922 0.151945 0.151064 0.169369
qa: -0.2044 -0.1988 -0.3282 -0.3195 -0.3760 0.3348 -0.1468 0.3040 -0.2252 -0.3297 -0.3686 -0.3304 -0.1663 0.2864 -0.2183 0.0063 -0.1670 0.3544 -0.1776 0.0360 0.2615 0.2854 -0.2929 -0.2295 -0.2515 -0.0616 0.0746 0.0974 0.0973 0.1024 0.1042 0.1028 0.1020 0.0970 0.1021 0.0977 0.1339 0.1403 0.0942 0.1015 0.1350 0.0968 0.0969 0.0882 0.1018 0.0849 0.1519 0.1511 0.1694
va: 1.0830 1.0940 2.1033 2.1006 3.0055 3.6147 3.8352 3.8116 3.8149 3.9162 3.9337 3.9171 3.8177 3.8749 3.9943 3.9325 4.0041 4.0328 3.4461 3.8197 3.9346 3.9674 3.9609 3.9732 3.9550 3.8166 1.0095 1.0035 1.0043 1.0030 1.0073 1.0003 1.0004 1.0036 1.0032 1.0042 1.0038 1.0031 1.0025 0.9982 1.0049 0.9855 0.9848 1.0073 1.0078 1.0017 1.0031 1.0035 0.9840
dispcorr: -0.024549300 hartree
energy: -1219.114099003358
dipole: -49.68549 49.52992 -0.15557 -0.95671 -0.12771 -1.08442 8.52455 -8.01502 0.50953
magnitude: 1.20822 au
magnitude: 3.07104 debye
