program: Orca
programVersion: 5.0.2
elementType: F F O O N C C C C C C C C C C C C C C C C C C C C C H H H H H H H H H H H H H H H H H H H H H H H
charge: 0
multiplicity: 1
keywords: wb97x-d3
keywords: def2-TZVPP
keywords: def2/J RIJCOSX
keywords: DEFGRID2
keywords: scfconv7
keywords: smallprint printgap noloewdin
keywords: NOSOSCF
formula: C21H23F2NO2
InChI: InChI=1/C21H23F2NO2/c1-5-25-18-11-13(21(2,3)4)9-10-14(18)17-12-26-20(24-17)19-15(22)7-6-8-16(19)23/h6-11,17H,5,12H2,1-4H3
49 atoms
F  2.547258 2.237663 -0.741821
F  4.711732 -1.69283 0.611334
O  2.043625 -1.230823 1.060265
O  -2.073461 -2.479448 0.052934
N  1.380918 -0.40702 -0.915174
C  -4.719603 1.732068 0.307824
C  -3.426527 0.949823 0.096108
C  0.269683 -1.237131 -0.472932
C  -1.002596 -0.448088 -0.292668
C  -5.914365 0.823299 0.593857
C  -5.029408 2.5505 -0.951394
C  -4.544609 2.680787 1.499961
C  -3.383232 -0.441531 0.16368
C  -2.191542 -1.134478 -0.028727
C  -2.239069 1.627446 -0.169324
C  0.78191 -1.880786 0.839104
C  -1.05188 0.93554 -0.357689
C  2.26869 -0.46783 -0.01867
C  3.558758 0.235987 -0.049638
C  -3.22895 -3.306097 0.115587
C  3.658516 1.572699 -0.424273
C  4.750779 -0.399806 0.285069
C  -3.960873 -3.400837 -1.206142
C  4.859391 2.251253 -0.457196
C  5.973735 0.236529 0.26186
C  6.016223 1.571117 -0.110194
H  0.10043 -2.009853 -1.227474
H  -5.774996 0.230643 1.500223
H  -6.121116 0.136926 -0.229952
H  -6.810277 1.429177 0.740686
H  -5.951241 3.121242 -0.817306
H  -5.162949 1.905381 -1.822173
H  -4.236938 3.262975 -1.185042
H  -3.737822 3.397713 1.340992
H  -4.323037 2.129907 2.41635
H  -5.4599 3.252261 1.670546
H  -4.290021 -0.990291 0.371627
H  -2.225645 2.708316 -0.232717
H  0.14485 -1.69392 1.702997
H  0.952108 -2.954157 0.746951
H  -0.144144 1.488751 -0.559368
H  -2.849579 -4.287655 0.400311
H  -3.897364 -2.981837 0.918907
H  -4.380176 -2.447293 -1.527794
H  -4.787229 -4.106287 -1.108266
H  -3.301795 -3.768035 -1.993768
H  4.8853 3.293219 -0.746084
H  6.872789 -0.30446 0.52467
H  6.965485 2.088674 -0.132742
elementType: F O N C H
totalener: -1219.09873309 hartree
nucrepener: 2325.51695664 hartree
electener: -3544.61568973 hartree
oneelecener: -6286.62314880 hartree
twoeener: 2742.00745907 hartree
cpcmener: -0.02390798 hartree
kineticenergy: 1213.92026416 hartree
xcener: -115.862242049544 hartree
chargesum: 0.0000000
charge: -0.199403 -0.203349 -0.320010 -0.337454 -0.375947 0.321139 -0.117418 0.164475 -0.100473 -0.363609 -0.326403 -0.327022 -0.187025 0.244179 -0.244503 0.041706 -0.168518 0.363064 -0.181873 0.027236 0.287687 0.309396 -0.258684 -0.239082 -0.257586 -0.054103 0.083009 0.101570 0.101013 0.102333 0.095364 0.101811 0.096848 0.096843 0.101525 0.095589 0.133930 0.133849 0.088507 0.093296 0.150699 0.104428 0.084222 0.091305 0.094733 0.088433 0.150045 0.149251 0.164974
qa: -0.1994 -0.2033 -0.3200 -0.3375 -0.3759 0.3211 -0.1174 0.1645 -0.1005 -0.3636 -0.3264 -0.3270 -0.1870 0.2442 -0.2445 0.0417 -0.1685 0.3631 -0.1819 0.0272 0.2877 0.3094 -0.2587 -0.2391 -0.2576 -0.0541 0.0830 0.1016 0.1010 0.1023 0.0954 0.1018 0.0968 0.0968 0.1015 0.0956 0.1339 0.1338 0.0885 0.0933 0.1507 0.1044 0.0842 0.0913 0.0947 0.0884 0.1500 0.1493 0.1650
va: 1.0977 1.0914 2.1250 2.0723 3.0162 3.6383 3.7801 3.9513 3.6701 3.9319 3.9178 3.9163 3.8447 3.9458 4.0728 3.9032 3.9816 3.9959 3.4826 3.8888 3.9426 3.9365 3.9125 3.9875 3.9688 3.8169 1.0115 1.0003 1.0004 1.0081 1.0039 1.0033 1.0046 1.0046 1.0036 1.0038 0.9965 1.0068 0.9985 0.9985 1.0090 0.9916 0.9942 1.0028 1.0093 1.0058 1.0037 1.0037 0.9852
dispcorr: -0.023455978 hartree
energy: -1219.122189067542
dipole: -56.94527 56.54104 -0.40424 2.06839 -2.40903 -0.34064 0.90582 -0.36841 0.53741
magnitude: 0.75382 au
magnitude: 1.91607 debye
