program: Orca
programVersion: 5.0.2
elementType: F F O O N C C C C C C C C C C C C C C C C C C C C C H H H H H H H H H H H H H H H H H H H H H H H
charge: 0
multiplicity: 1
keywords: wb97x-d3
keywords: def2-TZVPP
keywords: def2/J RIJCOSX
keywords: DEFGRID2
keywords: scfconv7
keywords: smallprint printgap noloewdin
keywords: NOSOSCF
formula: C21H23F2NO2
InChI: InChI=1/C21H23F2NO2/c1-5-25-18-11-13(21(2,3)4)9-10-14(18)17-12-26-20(24-17)19-15(22)7-6-8-16(19)23/h6-11,17H,5,12H2,1-4H3
49 atoms
F  3.381895 0.785123 2.272778
F  3.946597 -0.293862 -2.252793
O  2.033496 -1.284609 1.025969
O  -2.061421 -2.441214 -0.036966
N  1.403619 -0.317782 -0.894317
C  -4.810512 1.708512 -0.240251
C  -3.492279 0.944863 -0.324617
C  0.282127 -1.172561 -0.533202
C  -1.018527 -0.412193 -0.466244
C  -5.996338 0.800872 0.082806
C  -5.085108 2.398528 -1.581995
C  -4.703684 2.76784 0.863716
C  -3.418822 -0.432572 -0.124696
C  -2.202612 -1.105931 -0.198791
C  -2.310677 1.628798 -0.598715
C  0.708083 -1.801192 0.817141
C  -1.09954 0.956835 -0.666584
C  2.283117 -0.458146 0.000688
C  3.594633 0.206348 0.011684
C  -3.167967 -3.250405 0.341256
C  4.114871 0.800866 1.157347
C  4.384644 0.278626 -1.132117
C  -3.494941 -3.149208 1.816139
C  5.340536 1.43219 1.184246
C  5.618716 0.894918 -1.150458
C  6.089615 1.472056 0.018263
H  0.19149 -1.952037 -1.296909
H  -6.907893 1.397614 0.148838
H  -5.877259 0.28863 1.039695
H  -6.161394 0.044391 -0.687071
H  -5.177805 1.671469 -2.391313
H  -4.294032 3.098507 -1.854651
H  -6.018444 2.964282 -1.535497
H  -4.507575 2.308921 1.834951
H  -5.635902 3.331339 0.945377
H  -3.905415 3.485237 0.668619
H  -4.322023 -0.984611 0.089885
H  -2.319746 2.699342 -0.76107
H  0.082235 -1.498141 1.657471
H  0.763492 -2.888527 0.786899
H  -0.195483 1.511649 -0.880626
H  -4.04284 -3.028605 -0.277142
H  -2.862559 -4.268603 0.099082
H  -2.624785 -3.394374 2.426458
H  -4.283525 -3.862427 2.059851
H  -3.846892 -2.158282 2.104324
H  5.696438 1.886898 2.098902
H  6.198796 0.917619 -2.063225
H  7.053846 1.961647 0.020079
elementType: F O N C H
totalener: -1219.09886198 hartree
nucrepener: 2318.09948971 hartree
electener: -3537.19835169 hartree
oneelecener: -6271.74619535 hartree
twoeener: 2734.54784366 hartree
cpcmener: -0.02415762 hartree
kineticenergy: 1213.91247907 hartree
xcener: -115.860902529459 hartree
chargesum: 0.0000000
charge: -0.203871 -0.199301 -0.321193 -0.334300 -0.381787 0.322016 -0.134081 0.154143 -0.075462 -0.364359 -0.326152 -0.325951 -0.176650 0.237017 -0.232712 0.043629 -0.183102 0.383053 -0.180749 0.027619 0.308272 0.302036 -0.262122 -0.257227 -0.257939 -0.051769 0.080828 0.102158 0.100350 0.102409 0.101113 0.096970 0.095798 0.101378 0.095425 0.096543 0.133635 0.135584 0.084136 0.097554 0.135503 0.086565 0.105802 0.087962 0.096540 0.090452 0.149350 0.149220 0.165665
qa: -0.2039 -0.1993 -0.3212 -0.3343 -0.3818 0.3220 -0.1341 0.1541 -0.0755 -0.3644 -0.3262 -0.3260 -0.1766 0.2370 -0.2327 0.0436 -0.1831 0.3831 -0.1807 0.0276 0.3083 0.3020 -0.2621 -0.2572 -0.2579 -0.0518 0.0808 0.1022 0.1003 0.1024 0.1011 0.0970 0.0958 0.1014 0.0954 0.0965 0.1336 0.1356 0.0841 0.0976 0.1355 0.0866 0.1058 0.0880 0.0965 0.0905 0.1494 0.1492 0.1657
va: 1.0913 1.0967 2.1253 2.0742 2.9871 3.6372 3.8000 3.9505 3.6592 3.9320 3.9161 3.9170 3.8268 3.9814 4.0452 3.9001 3.9959 3.9514 3.4534 3.8779 3.9497 3.9584 3.9168 3.9725 3.9673 3.7992 1.0120 1.0079 1.0006 1.0001 1.0037 1.0045 1.0034 1.0035 1.0040 1.0049 0.9969 1.0054 1.0009 0.9980 1.0289 0.9957 0.9922 1.0045 1.0093 1.0026 1.0038 1.0040 0.9853
dispcorr: -0.023227919 hartree
energy: -1219.122089898475
dipole: -56.74058 56.34417 -0.39641 2.63714 -3.02049 -0.38336 4.00408 -3.24134 0.76274
magnitude: 0.94121 au
magnitude: 2.39236 debye
