program: Orca
programVersion: 5.0.2
elementType: F F O O N C C C C C C C C C C C C C C C C C C C C C H H H H H H H H H H H H H H H H H H H H H H H
charge: 0
multiplicity: 1
keywords: wb97x-d3
keywords: def2-TZVPP
keywords: def2/J RIJCOSX
keywords: DEFGRID2
keywords: scfconv7
keywords: smallprint printgap noloewdin
keywords: NOSOSCF
formula: C21H23F2NO2
InChI: InChI=1/C21H23F2NO2/c1-5-25-18-11-13(21(2,3)4)9-10-14(18)17-12-26-20(24-17)19-15(22)7-6-8-16(19)23/h6-11,17H,5,12H2,1-4H3
49 atoms
F  3.701366 2.117623 -0.574538
F  2.77249 -2.309904 0.650397
O  1.837865 -1.167219 -1.673362
O  -0.573568 -1.224707 0.136168
N  1.18007 0.868052 -0.996336
C  -5.127889 0.727143 0.524184
C  -3.75175 0.614982 -0.124965
C  0.166173 0.454682 -1.966633
C  -1.2055 0.459482 -1.345193
C  -5.356924 2.173423 0.980602
C  -5.276979 -0.184723 1.741352
C  -6.200153 0.342202 -0.502292
C  -2.782377 -0.268252 0.344613
C  -1.527694 -0.355453 -0.255266
C  -3.434481 1.409346 -1.225638
C  0.684014 -0.904436 -2.486427
C  -2.18268 1.327316 -1.813646
C  2.007593 -0.081219 -0.905658
C  3.173474 -0.095369 -0.010799
C  -0.632557 -1.846802 1.412799
C  3.978249 1.030183 0.144258
C  3.525697 -1.211133 0.742267
C  -0.346494 -0.885121 2.545082
C  5.065021 1.061354 0.993579
C  4.602163 -1.22612 1.603912
C  5.369454 -0.077782 1.723078
H  0.151123 1.180702 -2.783012
H  -5.326867 2.879288 0.149192
H  -4.603878 2.485454 1.707184
H  -6.335846 2.272209 1.455427
H  -4.550676 0.047163 2.52332
H  -5.171351 -1.241024 1.484933
H  -6.270048 -0.05856 2.176798
H  -6.065192 -0.682938 -0.853557
H  -6.186099 0.996269 -1.375827
H  -7.196318 0.411786 -0.058908
H  -3.006975 -0.900766 1.19107
H  -4.157348 2.107682 -1.628661
H  -0.022666 -1.728051 -2.388177
H  1.005082 -0.846322 -3.52779
H  -1.951013 1.967602 -2.657668
H  -1.587961 -2.359527 1.557198
H  0.132189 -2.621402 1.377775
H  0.624359 -0.40418 2.416494
H  -0.325256 -1.433238 3.487978
H  -1.103392 -0.104808 2.635796
H  5.662249 1.959469 1.078084
H  4.82993 -2.117988 2.172478
H  6.216798 -0.07042 2.395215
elementType: F O N C H
totalener: -1219.09724911 hartree
nucrepener: 2404.24476207 hartree
electener: -3623.34201118 hartree
oneelecener: -6444.50865082 hartree
twoeener: 2821.16663964 hartree
cpcmener: -0.02633893 hartree
kineticenergy: 1213.92100428 hartree
xcener: -115.861426759064 hartree
chargesum: 0.0000000
charge: -0.198467 -0.205754 -0.320759 -0.328847 -0.369160 0.315574 -0.107213 0.342316 -0.251260 -0.326425 -0.361386 -0.325897 -0.190900 0.284326 -0.198633 -0.001052 -0.196282 0.353343 -0.195608 0.006914 0.304202 0.271336 -0.262746 -0.256997 -0.236557 -0.058125 0.077767 0.096233 0.102455 0.096282 0.102332 0.100499 0.102136 0.102199 0.096569 0.095968 0.137617 0.135829 0.096265 0.096926 0.132141 0.098475 0.100886 0.086165 0.098915 0.094630 0.148179 0.150430 0.165162
qa: -0.1985 -0.2058 -0.3208 -0.3288 -0.3692 0.3156 -0.1072 0.3423 -0.2513 -0.3264 -0.3614 -0.3259 -0.1909 0.2843 -0.1986 -0.0011 -0.1963 0.3533 -0.1956 0.0069 0.3042 0.2713 -0.2627 -0.2570 -0.2366 -0.0581 0.0778 0.0962 0.1025 0.0963 0.1023 0.1005 0.1021 0.1022 0.0966 0.0960 0.1376 0.1358 0.0963 0.0969 0.1321 0.0985 0.1009 0.0862 0.0989 0.0946 0.1482 0.1504 0.1652
va: 1.0978 1.0847 2.1196 2.0937 3.0122 3.6465 3.7772 3.7626 3.8773 3.9180 3.9316 3.9166 3.8404 3.8347 3.9838 3.9340 4.0488 4.0132 3.4859 3.8695 3.9481 3.9343 3.9262 3.9672 3.9824 3.8144 1.0036 1.0052 1.0031 1.0037 1.0005 1.0003 1.0081 1.0033 1.0044 1.0037 0.9948 1.0041 1.0015 0.9993 1.0060 0.9957 0.9999 1.0024 1.0096 1.0028 1.0046 1.0034 0.9854
dispcorr: -0.025450186 hartree
energy: -1219.122699296284
dipole: -48.58032 48.59675 0.01643 1.69155 -2.42252 -0.73097 11.60790 -10.70690 0.90100
magnitude: 1.16034 au
magnitude: 2.94934 debye
