program: Orca
programVersion: 5.0.2
elementType: F F O O N C C C C C C C C C C C C C C C C C C C C C H H H H H H H H H H H H H H H H H H H H H H H
charge: 0
multiplicity: 1
keywords: wb97x-d3
keywords: def2-TZVPP
keywords: def2/J RIJCOSX
keywords: DEFGRID2
keywords: scfconv7
keywords: smallprint printgap noloewdin
keywords: NOSOSCF
formula: C21H23F2NO2
InChI: InChI=1/C21H23F2NO2/c1-5-25-18-11-13(21(2,3)4)9-10-14(18)17-12-26-20(24-17)19-15(22)7-6-8-16(19)23/h6-11,17H,5,12H2,1-4H3
49 atoms
F  2.61148 2.307544 -0.417874
F  4.668311 -1.834278 0.375544
O  1.994603 -1.461224 0.673247
O  -2.10095 -2.350805 -0.685165
N  1.403434 -0.179189 -1.066377
C  -4.768315 1.691234 0.321367
C  -3.433174 1.022369 0.006961
C  0.265029 -1.062211 -0.860924
C  -1.00708 -0.305319 -0.570929
C  -5.362711 1.076093 1.594598
C  -5.734712 1.469368 -0.848679
C  -4.62228 3.196018 0.543524
C  -3.398966 -0.362061 -0.193837
C  -2.210801 -1.019437 -0.476249
C  -2.238981 1.722965 -0.087313
C  0.706846 -1.981619 0.303826
C  -1.047528 1.061735 -0.37475
C  2.263964 -0.470728 -0.188367
C  3.561655 0.197243 -0.017706
C  -3.214775 -3.209784 -0.4763
C  3.693896 1.577633 -0.14849
C  4.727335 -0.505292 0.278141
C  -3.493436 -3.467267 0.988921
C  4.89661 2.232552 0.016394
C  5.951132 0.107335 0.445677
C  6.024815 1.484863 0.314762
H  0.122378 -1.651615 -1.77103
H  -5.559647 0.00823 1.486758
H  -6.31209 1.556827 1.841731
H  -4.694321 1.205357 2.448259
H  -6.69464 1.950406 -0.646771
H  -5.932761 0.41094 -1.025536
H  -5.340613 1.892482 -1.774799
H  -5.597681 3.630328 0.77039
H  -4.237929 3.709804 -0.339595
H  -3.962436 3.42718 1.381932
H  -4.322271 -0.921936 -0.123769
H  -2.207928 2.793112 0.062336
H  0.05552 -1.931369 1.176411
H  0.824702 -3.023416 0.005434
H  -0.131044 1.633316 -0.440165
H  -4.101832 -2.827755 -0.990111
H  -2.942622 -4.142136 -0.971522
H  -2.624106 -3.903244 1.482777
H  -4.317505 -4.176572 1.078679
H  -3.776968 -2.564448 1.530774
H  4.945793 3.308302 -0.08441
H  6.828029 -0.485552 0.668398
H  6.976105 1.982635 0.443627
elementType: F O N C H
totalener: -1219.09883073 hartree
nucrepener: 2328.76631229 hartree
electener: -3547.86514302 hartree
oneelecener: -6293.05330493 hartree
twoeener: 2745.18816191 hartree
cpcmener: -0.02413074 hartree
kineticenergy: 1213.91376893 hartree
xcener: -115.861441815648 hartree
chargesum: -0.0000000
charge: -0.197359 -0.202304 -0.321107 -0.337717 -0.374686 0.320992 -0.089372 0.159855 -0.110163 -0.326243 -0.327041 -0.356605 -0.228407 0.214417 -0.219538 0.047600 -0.140851 0.359662 -0.167362 0.025727 0.282993 0.302298 -0.260537 -0.237119 -0.253923 -0.056412 0.080614 0.090804 0.097635 0.103360 0.096414 0.094737 0.102648 0.100065 0.100244 0.101113 0.127149 0.140267 0.085374 0.094090 0.146636 0.087813 0.105776 0.088517 0.096061 0.089984 0.150099 0.148852 0.164948
qa: -0.1974 -0.2023 -0.3211 -0.3377 -0.3747 0.3210 -0.0894 0.1599 -0.1102 -0.3262 -0.3270 -0.3566 -0.2284 0.2144 -0.2195 0.0476 -0.1409 0.3597 -0.1674 0.0257 0.2830 0.3023 -0.2605 -0.2371 -0.2539 -0.0564 0.0806 0.0908 0.0976 0.1034 0.0964 0.0947 0.1026 0.1001 0.1002 0.1011 0.1271 0.1403 0.0854 0.0941 0.1466 0.0878 0.1058 0.0885 0.0961 0.0900 0.1501 0.1489 0.1649
va: 1.0989 1.0917 2.1259 2.0713 3.0184 3.6473 3.7449 3.9740 3.6729 3.9173 3.9194 3.9238 3.9686 3.9755 3.9669 3.9076 3.9778 4.0058 3.4663 3.8794 3.9512 3.9449 3.9167 3.9850 3.9653 3.8196 1.0110 1.0038 1.0043 1.0036 1.0036 1.0035 1.0042 1.0075 1.0013 1.0013 1.0024 1.0006 0.9995 0.9982 1.0124 0.9949 0.9924 1.0046 1.0098 1.0019 1.0037 1.0038 0.9853
dispcorr: -0.023680954 hartree
energy: -1219.122511687765
dipole: -56.54493 56.14194 -0.40299 1.21894 -1.74576 -0.52682 6.01400 -5.26144 0.75256
magnitude: 1.00314 au
magnitude: 2.54978 debye
