program: Orca
programVersion: 5.0.2
elementType: Br Cl F F F O N N C C C C C C C C C C C C C C C H H H H H H H H H H H
charge: 0
multiplicity: 1
keywords: wb97x-d3
keywords: def2-TZVPP
keywords: def2/J RIJCOSX
keywords: DEFGRID2
keywords: scfconv7
keywords: smallprint printgap noloewdin
keywords: NOSOSCF
formula: C15H11BrClF3N2O
InChI: InChI=1/C15H11BrClF3N2O/c1-2-23-8-22-13(9-3-5-10(17)6-4-9)11(7-21)12(16)14(22)15(18,19)20/h3-6H,2,8H2,1H3
34 atoms
Br -3.238771 -1.987028 0.464986
Cl 6.377918 -0.677194 0.029691
F  -2.705907 2.127799 -1.196405
F  -3.948555 0.910156 0.062369
F  -2.67512 2.403307 0.9341
O  0.204512 2.412329 -1.533167
N  -0.327643 0.790311 0.020058
N  0.23596 -3.857986 0.564596
C  0.428848 -0.325577 0.150483
C  -1.66744 0.458022 0.086065
C  -0.430378 -1.395703 0.31973
C  0.215255 2.122171 -0.169687
C  -1.752793 -0.893762 0.279273
C  1.891285 -0.366522 0.114996
C  -2.749232 1.474241 -0.029698
C  2.615201 0.179236 -0.944637
C  2.57322 -1.015105 1.143436
C  0.241739 3.804024 -1.822317
C  3.996195 0.088889 -0.971767
C  3.953978 -1.114482 1.122651
C  -0.05801 -2.746849 0.455672
C  4.653396 -0.558599 0.063094
C  1.557686 4.463069 -1.463867
H  -0.373803 2.838584 0.40693
H  1.220432 2.120697 0.25648
H  2.106254 0.666335 -1.76484
H  2.028047 -1.432797 1.979938
H  0.061283 3.881216 -2.894489
H  -0.585921 4.311607 -1.312461
H  4.548498 0.512933 -1.798855
H  4.4725 -1.614602 1.928743
H  1.544639 5.499487 -1.80244
H  1.736622 4.474658 -0.387611
H  2.398228 3.963478 -1.947035
elementType: Br Cl F O N C H
totalener: -4097.00899855 hartree
nucrepener: 2572.54788673 hartree
electener: -6669.55688528 hartree
twoeener: 4121.30138630 hartree
cpcmener: -0.02801511 hartree
kineticenergy: 4088.58003464 hartree
xcener: -188.030757720251 hartree
chargesum: -0.0000000
charge: 0.051233 -0.087051 -0.166877 -0.160379 -0.172295 -0.369992 0.009329 -0.105844 0.303877 -0.077193 0.165380 0.000151 -0.191437 -0.136582 0.542045 -0.183464 -0.218652 0.059526 -0.175514 -0.181437 -0.161048 0.142368 -0.261540 0.159119 0.157077 0.153788 0.165709 0.100539 0.074856 0.146014 0.146005 0.097694 0.091648 0.082951
qa: 0.0512 -0.0871 -0.1669 -0.1604 -0.1723 -0.3700 0.0093 -0.1058 0.3039 -0.0772 0.1654 0.0002 -0.1914 -0.1366 0.5420 -0.1835 -0.2187 0.0595 -0.1755 -0.1814 -0.1610 0.1424 -0.2615 0.1591 0.1571 0.1538 0.1657 0.1005 0.0749 0.1460 0.1460 0.0977 0.0916 0.0830
va: 1.3063 1.2185 1.1342 1.1463 1.1280 1.8971 3.4306 3.1384 3.5660 3.6963 3.6041 3.9330 4.2006 3.4907 4.4763 3.9373 3.9925 3.8663 4.0283 4.0316 4.0254 3.8299 3.9216 0.9908 0.9712 1.0343 0.9971 0.9917 1.0049 1.0091 1.0084 1.0097 0.9993 1.0065
dispcorr: -0.018601639 hartree
energy: -4097.027600187846
dipole: 48.10954 -47.21925 0.89029 37.93629 -34.35012 3.58617 -11.14376 11.20867 0.06491
magnitude: 3.69560 au
magnitude: 9.39347 debye
