program: Orca
programVersion: 5.0.2
elementType: Br Cl F F F O N N C C C C C C C C C C C C C C C H H H H H H H H H H H
charge: 0
multiplicity: 1
keywords: wb97x-d3
keywords: def2-TZVPP
keywords: def2/J RIJCOSX
keywords: DEFGRID2
keywords: scfconv7
keywords: smallprint printgap noloewdin
keywords: NOSOSCF
formula: C15H11BrClF3N2O
InChI: InChI=1/C15H11BrClF3N2O/c1-2-23-8-22-13(9-3-5-10(17)6-4-9)11(7-21)12(16)14(22)15(18,19)20/h3-6H,2,8H2,1H3
34 atoms
Br -3.184342 -1.785998 0.556056
Cl 6.494951 -1.072307 -0.089725
F  -3.680366 0.777936 -1.012665
F  -2.890369 2.147909 0.4299
F  -2.239604 2.241856 -1.619743
O  -0.074104 2.894707 0.065181
N  -0.134569 0.665802 -0.453463
N  0.235735 -3.750286 1.148544
C  0.56904 -0.421253 -0.057163
C  -1.48797 0.416848 -0.333797
C  -0.338835 -1.391168 0.329406
C  0.458472 1.946968 -0.801989
C  -1.633979 -0.853477 0.153819
C  2.027977 -0.541397 -0.074818
C  -2.565381 1.404367 -0.634067
C  2.76198 -0.311398 -1.237875
C  2.692892 -0.949268 1.079929
C  0.096799 4.230935 -0.387198
C  4.136754 -0.47093 -1.246021
C  4.067594 -1.116708 1.080862
C  -0.021081 -2.687728 0.776777
C  4.777735 -0.87224 -0.083652
C  -0.695903 5.147644 0.51051
H  1.539777 1.852819 -0.687262
H  0.25434 2.176362 -1.851545
H  2.26137 -0.019575 -2.152391
H  2.14005 -1.123475 1.993865
H  1.158845 4.500718 -0.372204
H  -0.245143 4.32483 -1.424491
H  4.696896 -0.291272 -2.153139
H  4.574228 -1.427414 1.984101
H  -0.360403 5.085267 1.545975
H  -0.568308 6.177915 0.180178
H  -1.760381 4.914894 0.475352
elementType: Br Cl F O N C H
totalener: -4097.00870969 hartree
nucrepener: 2572.30975339 hartree
electener: -6669.31846308 hartree
twoeener: 4121.36934679 hartree
cpcmener: -0.03070798 hartree
kineticenergy: 4088.58679439 hartree
xcener: -188.031580300994 hartree
chargesum: 0.0000000
charge: 0.048439 -0.086764 -0.165142 -0.172581 -0.170902 -0.376228 -0.001076 -0.106370 0.309161 -0.008653 0.156851 0.057783 -0.230735 -0.121512 0.522285 -0.221609 -0.213795 0.043230 -0.166752 -0.182940 -0.156504 0.138955 -0.250129 0.143288 0.149457 0.165133 0.166047 0.095049 0.083892 0.146479 0.146846 0.086979 0.090497 0.081322
qa: 0.0484 -0.0868 -0.1651 -0.1726 -0.1709 -0.3762 -0.0011 -0.1064 0.3092 -0.0087 0.1569 0.0578 -0.2307 -0.1215 0.5223 -0.2216 -0.2138 0.0432 -0.1668 -0.1829 -0.1565 0.1390 -0.2501 0.1433 0.1495 0.1651 0.1660 0.0950 0.0839 0.1465 0.1468 0.0870 0.0905 0.0813
va: 1.3084 1.2189 1.1362 1.1194 1.1330 1.9223 3.4425 3.1384 3.5534 3.6379 3.5999 3.9214 4.2602 3.5078 4.5070 3.9796 3.9821 3.8586 4.0105 4.0314 4.0189 3.8340 3.9499 0.9871 0.9783 0.9990 0.9977 0.9900 0.9959 1.0081 1.0081 1.0034 1.0084 1.0087
dispcorr: -0.017988259 hartree
energy: -4097.026697953852
dipole: 41.86248 -40.54633 1.31615 37.73321 -34.57099 3.16222 -5.33206 3.75103 -1.58103
magnitude: 3.77247 au
magnitude: 9.58886 debye
