program: Orca
programVersion: 5.0.2
elementType: Br Cl F F F O N N C C C C C C C C C C C C C C C H H H H H H H H H H H
charge: 0
multiplicity: 1
keywords: wb97x-d3
keywords: def2-TZVPP
keywords: def2/J RIJCOSX
keywords: DEFGRID2
keywords: scfconv7
keywords: smallprint printgap noloewdin
keywords: NOSOSCF
formula: C15H11BrClF3N2O
InChI: InChI=1/C15H11BrClF3N2O/c1-2-23-8-22-13(9-3-5-10(17)6-4-9)11(7-21)12(16)14(22)15(18,19)20/h3-6H,2,8H2,1H3
34 atoms
Br -3.213219 -1.687528 -0.049668
Cl 6.461359 -0.761285 0.364234
F  -2.239212 2.7009 1.252351
F  -3.047208 2.163017 -0.670768
F  -3.671053 1.11578 1.092231
O  -0.18431 3.051846 -0.710017
N  -0.178937 0.949226 0.373677
N  0.193297 -3.730848 -0.097424
C  0.531726 -0.194024 0.229788
C  -1.527386 0.663347 0.330194
C  -0.367359 -1.237173 0.084065
C  0.400926 2.302474 0.291876
C  -1.666161 -0.683862 0.138329
C  1.990211 -0.287566 0.257239
C  -2.613986 1.669245 0.494422
C  2.734984 0.283179 1.289423
C  2.646751 -1.006163 -0.740123
C  0.365762 2.9028 -2.018244
C  4.111517 0.144287 1.323181
C  4.022878 -1.156344 -0.711584
C  -0.05012 -2.604789 -0.020593
C  4.743043 -0.577607 0.321665
C  -0.045325 1.637005 -2.740956
H  0.251815 2.812163 1.240923
H  1.47386 2.177928 0.137685
H  2.243115 0.827492 2.085363
H  2.086366 -1.440311 -1.55801
H  0.010161 3.772261 -2.571642
H  1.45751 2.973438 -1.966166
H  4.680142 0.588797 2.128267
H  4.522773 -1.713474 -1.491622
H  -1.128447 1.513864 -2.75337
H  0.290736 1.70435 -3.776556
H  0.405488 0.738915 -2.31861
elementType: Br Cl F O N C H
totalener: -4097.00853357 hartree
nucrepener: 2621.30746425 hartree
electener: -6718.31599782 hartree
twoeener: 4169.86875182 hartree
cpcmener: -0.03115566 hartree
kineticenergy: 4088.59205994 hartree
xcener: -188.034397802867 hartree
chargesum: 0.0000000
charge: 0.049792 -0.086855 -0.169785 -0.167004 -0.166022 -0.370400 0.020448 -0.105357 0.153960 -0.032567 0.273217 0.031057 -0.230239 -0.065619 0.501267 -0.220308 -0.242820 0.050813 -0.168393 -0.180461 -0.136976 0.138671 -0.254674 0.150071 0.148812 0.163192 0.163411 0.105652 0.080733 0.146826 0.146199 0.083876 0.109470 0.080013
qa: 0.0498 -0.0869 -0.1698 -0.1670 -0.1660 -0.3704 0.0204 -0.1054 0.1540 -0.0326 0.2732 0.0311 -0.2302 -0.0656 0.5013 -0.2203 -0.2428 0.0508 -0.1684 -0.1805 -0.1370 0.1387 -0.2547 0.1501 0.1488 0.1632 0.1634 0.1057 0.0807 0.1468 0.1462 0.0839 0.1095 0.0800
va: 1.3126 1.2188 1.1353 1.1206 1.1351 1.9497 3.3390 3.1411 3.5665 3.6271 3.4647 3.9637 4.2597 3.4245 4.5333 3.9846 4.0070 3.8660 4.0167 4.0425 3.9882 3.8337 3.9150 0.9931 0.9750 0.9992 0.9992 0.9902 1.0020 1.0080 1.0083 1.0140 1.0104 0.9914
dispcorr: -0.020429533 hartree
energy: -4097.028963098352
dipole: 44.74025 -43.12517 1.61507 24.25748 -21.68988 2.56760 -11.72594 11.47574 -0.25020
magnitude: 3.04362 au
magnitude: 7.73627 debye
