program: Orca
programVersion: 5.0.2
elementType: Br Cl F F F O N N C C C C C C C C C C C C C C C H H H H H H H H H H H
charge: 0
multiplicity: 1
keywords: wb97x-d3
keywords: def2-TZVPP
keywords: def2/J RIJCOSX
keywords: DEFGRID2
keywords: scfconv7
keywords: smallprint printgap noloewdin
keywords: NOSOSCF
formula: C15H11BrClF3N2O
InChI: InChI=1/C15H11BrClF3N2O/c1-2-23-8-22-13(9-3-5-10(17)6-4-9)11(7-21)12(16)14(22)15(18,19)20/h3-6H,2,8H2,1H3
34 atoms
Br -3.173963 -1.743882 0.72969
Cl 6.440284 -0.970045 -0.136244
F  -3.816975 0.773077 -0.816476
F  -2.846121 2.277847 0.364974
F  -2.453621 2.134099 -1.748219
O  -0.110442 3.087116 -0.58915
N  -0.226411 0.7233 -0.534854
N  0.303922 -3.617417 1.218881
C  0.510344 -0.341346 -0.142061
C  -1.567102 0.448165 -0.359844
C  -0.360685 -1.320002 0.300173
C  0.325088 1.924966 -1.182872
C  -1.671592 -0.809543 0.172951
C  1.973746 -0.440688 -0.174727
C  -2.663492 1.416183 -0.64304
C  2.777042 0.408313 0.584101
C  2.568266 -1.459875 -0.914019
C  0.450016 3.371535 0.686833
C  4.152274 0.253935 0.59374
C  3.943237 -1.626975 -0.906963
C  0.007701 -2.581528 0.809286
C  4.723656 -0.765933 -0.152537
C  -0.107449 4.687789 1.169467
H  1.41177 1.818458 -1.162211
H  0.009693 1.93605 -2.224631
H  2.329816 1.186301 1.188575
H  1.957881 -2.128132 -1.508024
H  0.208805 2.576674 1.401945
H  1.542195 3.422106 0.608364
H  4.766381 0.915067 1.189913
H  4.394618 -2.421353 -1.485482
H  0.301306 4.916636 2.153706
H  0.156326 5.506752 0.499383
H  -1.193592 4.651994 1.260991
elementType: Br Cl F O N C H
totalener: -4097.02055056 hartree
nucrepener: 2589.24477408 hartree
electener: -6686.26532464 hartree
twoeener: 4137.74041965 hartree
cpcmener: -0.02682632 hartree
kineticenergy: 4088.60293852 hartree
xcener: -188.033778228158 hartree
chargesum: -0.0000000
charge: 0.050170 -0.084526 -0.163011 -0.167788 -0.168610 -0.351853 0.007607 -0.088636 0.295750 -0.037708 0.158680 0.056589 -0.214275 -0.141872 0.515310 -0.215390 -0.210167 0.036819 -0.168843 -0.171408 -0.160381 0.133764 -0.262519 0.139323 0.144384 0.177126 0.159770 0.089740 0.093134 0.143315 0.144777 0.087191 0.087735 0.085804
qa: 0.0502 -0.0845 -0.1630 -0.1678 -0.1686 -0.3519 0.0076 -0.0886 0.2958 -0.0377 0.1587 0.0566 -0.2143 -0.1419 0.5153 -0.2154 -0.2102 0.0368 -0.1688 -0.1714 -0.1604 0.1338 -0.2625 0.1393 0.1444 0.1771 0.1598 0.0897 0.0931 0.1433 0.1448 0.0872 0.0877 0.0858
va: 1.3082 1.2206 1.1395 1.1216 1.1345 1.9551 3.3843 3.1417 3.5279 3.6712 3.6083 3.9203 4.2337 3.5344 4.5146 3.9482 3.9847 3.8495 4.0389 4.0204 4.0163 3.8428 3.9737 0.9834 0.9936 0.9970 1.0002 0.9842 0.9893 1.0106 1.0080 1.0068 1.0035 1.0068
dispcorr: -0.019139928 hartree
energy: -4097.039690484649
dipole: 44.15809 -42.81579 1.34230 33.67296 -31.28563 2.38733 -2.66641 1.91413 -0.75229
magnitude: 2.84025 au
magnitude: 7.21935 debye
