program: Orca
programVersion: 5.0.2
elementType: Br Cl F F F O N N C C C C C C C C C C C C C C C H H H H H H H H H H H
charge: 0
multiplicity: 1
keywords: wb97x-d3
keywords: def2-TZVPP
keywords: def2/J RIJCOSX
keywords: DEFGRID2
keywords: scfconv7
keywords: smallprint printgap noloewdin
keywords: NOSOSCF
formula: C15H11BrClF3N2O
InChI: InChI=1/C15H11BrClF3N2O/c1-2-23-8-22-13(9-3-5-10(17)6-4-9)11(7-21)12(16)14(22)15(18,19)20/h3-6H,2,8H2,1H3
34 atoms
Br -3.202385 -1.795947 0.648405
Cl 6.364953 -0.879337 -0.58578
F  -3.915836 0.804032 -0.671502
F  -2.792686 2.557912 -0.156103
F  -2.554197 1.664822 -2.094121
O  0.829586 2.816442 0.192219
N  -0.301143 0.819201 -0.415442
N  0.32145 -3.529239 1.297867
C  0.457481 -0.235598 -0.015816
C  -1.641345 0.50016 -0.284253
C  -0.396554 -1.235399 0.401982
C  0.283359 2.090288 -0.844896
C  -1.720727 -0.768187 0.228831
C  1.91851 -0.330285 -0.137508
C  -2.73049 1.379545 -0.793691
C  2.433235 -1.3466 -0.942461
C  2.80577 0.500917 0.542954
C  -0.073835 3.467784 1.069428
C  3.797795 -1.522478 -1.083994
C  4.172971 0.333203 0.405848
C  -0.006022 -2.499794 0.898465
C  4.662475 -0.674605 -0.410312
C  0.73239 4.268233 2.065156
H  1.099013 1.853954 -1.527167
H  -0.470787 2.651986 -1.398473
H  1.758801 -2.008649 -1.469817
H  2.434912 1.280312 1.190567
H  -0.738172 4.129955 0.502369
H  -0.702202 2.73987 1.594529
H  4.183524 -2.313122 -1.712121
H  4.85505 0.981317 0.938179
H  0.061944 4.798373 2.740844
H  1.37254 3.625694 2.669492
H  1.359938 5.005886 1.565937
totalener: -4096.99973148 hartree
nucrepener: 2582.99489760 hartree
electener: -6679.99462907 hartree
twoeener: 4131.94563135 hartree
kineticenergy: 4088.62528948 hartree
xcener: -188.035250071993 hartree
chargesum: -0.0000000
charge: 0.073058 -0.062724 -0.145073 -0.164434 -0.168667 -0.310557 0.000434 0.006245 0.238975 -0.125391 0.143671 0.018846 -0.163500 -0.157306 0.539666 -0.186006 -0.101042 0.032674 -0.143056 -0.168000 -0.213215 0.118319 -0.244988 0.128791 0.126771 0.137892 0.118891 0.081976 0.084226 0.125494 0.121795 0.085460 0.082505 0.088267
qa: 0.0731 -0.0627 -0.1451 -0.1644 -0.1687 -0.3106 0.0004 0.0062 0.2390 -0.1254 0.1437 0.0188 -0.1635 -0.1573 0.5397 -0.1860 -0.1010 0.0327 -0.1431 -0.1680 -0.2132 0.1183 -0.2450 0.1288 0.1268 0.1379 0.1189 0.0820 0.0842 0.1255 0.1218 0.0855 0.0825 0.0883
va: 1.3254 1.2442 1.1697 1.1281 1.1285 1.9725 3.3140 3.1454 3.5661 3.6843 3.6547 3.9776 4.1951 3.5681 4.4718 4.0183 3.9593 3.8580 4.0455 4.0593 4.0109 3.9286 3.9738 0.9925 1.0113 1.0056 1.0358 0.9967 0.9870 1.0141 1.0160 1.0078 1.0038 1.0065
dispcorr: -0.019151290 hartree
energy: -4097.018882767313
dipole: 44.05367 -43.86273 0.19094 34.54942 -32.47649 2.07293 2.32990 -2.82546 -0.49556
magnitude: 2.13988 au
magnitude: 5.43915 debye
