program: Orca
programVersion: 5.0.2
elementType: Br Cl F F F O N N C C C C C C C C C C C C C C C H H H H H H H H H H H
charge: 0
multiplicity: 1
keywords: wb97x-d3
keywords: def2-TZVPP
keywords: def2/J RIJCOSX
keywords: DEFGRID2
keywords: scfconv7
keywords: smallprint printgap noloewdin
keywords: NOSOSCF
formula: C15H11BrClF3N2O
InChI: InChI=1/C15H11BrClF3N2O/c1-2-23-8-22-13(9-3-5-10(17)6-4-9)11(7-21)12(16)14(22)15(18,19)20/h3-6H,2,8H2,1H3
34 atoms
Br -3.197459 -1.657572 -0.074285
Cl 6.484282 -0.666314 0.400902
F  -2.218382 2.716625 1.287127
F  -3.032785 2.188223 -0.63613
F  -3.657662 1.13645 1.126001
O  -0.066429 3.031549 -0.764858
N  -0.168998 0.972236 0.400757
N  0.248738 -3.683185 -0.27195
C  0.544127 -0.172663 0.223639
C  -1.517117 0.682593 0.354487
C  -0.350923 -1.210271 0.048999
C  0.409683 2.320978 0.308052
C  -1.651774 -0.660029 0.126082
C  2.004134 -0.258209 0.262304
C  -2.606168 1.6897 0.525186
C  2.731853 0.255872 1.335651
C  2.687228 -0.913256 -0.759318
C  0.478186 2.711488 -2.036345
C  4.109099 0.138222 1.379849
C  4.064614 -1.044132 -0.720192
C  -0.022397 -2.573753 -0.121717
C  4.769386 -0.51216 0.347977
C  -0.256356 1.602899 -2.767681
H  0.168466 2.877607 1.210223
H  1.493523 2.183918 0.266884
H  2.217885 0.732085 2.161286
H  2.140266 -1.323783 -1.597756
H  0.414985 3.632789 -2.616648
H  1.543952 2.466625 -1.939082
H  4.664618 0.536039 2.217461
H  4.5857 -1.556358 -1.516539
H  -1.320239 1.820212 -2.843938
H  0.139135 1.519713 -3.780657
H  -0.141401 0.627264 -2.296282
totalener: -4096.99767628 hartree
nucrepener: 2624.27207599 hartree
electener: -6721.26975227 hartree
twoeener: 4173.19572099 hartree
kineticenergy: 4088.64124055 hartree
xcener: -188.041370497298 hartree
chargesum: -0.0000000
charge: 0.076183 -0.057412 -0.171250 -0.155432 -0.153403 -0.299035 -0.005863 0.006725 0.117385 -0.064169 0.247484 0.005737 -0.206396 -0.082383 0.513677 -0.216360 -0.201989 0.034420 -0.145309 -0.157760 -0.183979 0.119747 -0.239295 0.131942 0.127720 0.138971 0.137798 0.103348 0.060277 0.126666 0.126935 0.096529 0.097992 0.070500
qa: 0.0762 -0.0574 -0.1712 -0.1554 -0.1534 -0.2990 -0.0059 0.0067 0.1174 -0.0642 0.2475 0.0057 -0.2064 -0.0824 0.5137 -0.2164 -0.2020 0.0344 -0.1453 -0.1578 -0.1840 0.1197 -0.2393 0.1319 0.1277 0.1390 0.1378 0.1033 0.0603 0.1267 0.1269 0.0965 0.0980 0.0705
va: 1.3335 1.2498 1.1336 1.1389 1.1536 2.0079 3.2688 3.1472 3.5415 3.6643 3.5080 4.0197 4.2764 3.4427 4.5084 3.9755 4.0406 3.8982 4.0450 4.0653 3.9808 3.9514 3.9116 0.9975 0.9792 1.0079 1.0091 0.9930 1.0014 1.0155 1.0146 1.0149 1.0136 0.9986
dispcorr: -0.020657184 hartree
energy: -4097.018333460651
dipole: 44.20854 -43.11409 1.09444 23.45470 -21.78579 1.66892 -11.55537 11.37749 -0.17788
magnitude: 2.00368 au
magnitude: 5.09295 debye
