program: Orca
programVersion: 5.0.2
elementType: S S O O N N N C C C C C C C H H H H H H H H H H H H H H H
charge: 0
multiplicity: 1
keywords: wb97x-d3
keywords: def2-TZVPP
keywords: def2/J RIJCOSX
keywords: DEFGRID2
keywords: scfconv7
keywords: smallprint printgap noloewdin
keywords: NOSOSCF
formula: C7H15N3O2S2
InChI: InChI=1/C7H15N3O2S2/c1-10(2)5(3-13-6(8)11)4-14-7(9)12/h5H,3-4,8-9H2,1-2H3
29 atoms
S  0.44143 -2.586153 0.457796
S  0.355229 2.405122 0.092922
O  -0.790732 -2.935791 -1.869086
O  2.318972 2.411048 1.881685
N  -1.926895 0.655608 -0.366799
N  1.116038 -4.108483 -1.552509
N  2.126143 4.253431 0.587422
C  -0.713966 -0.082236 -0.066779
C  -0.960566 -1.450024 0.592477
C  0.231248 0.740755 0.802585
C  -2.657239 0.128608 -1.497125
C  -2.792642 0.906428 0.764139
C  0.165098 -3.242746 -1.18592
C  1.765511 3.027329 0.991314
H  -0.215993 -0.249315 -1.026112
H  -1.143347 -1.346813 1.664141
H  -1.83493 -1.944826 0.169381
H  -0.119039 0.805303 1.833397
H  1.216751 0.276076 0.814272
H  -3.448155 0.827747 -1.775311
H  -3.135304 -0.845319 -1.318842
H  -1.995339 0.02433 -2.357988
H  -2.239618 1.345798 1.594729
H  -3.311037 0.012911 1.140814
H  -3.561018 1.627066 0.478351
H  1.899095 -4.345513 -0.965238
H  1.055943 -4.558666 -2.452969
H  1.675962 4.736089 -0.172915
H  2.902487 4.713716 1.03692
elementType: S O N C H
totalener: -1387.02089413 hartree
nucrepener: 1176.16546518 hartree
electener: -2563.18635932 hartree
oneelecener: -4243.79205833 hartree
twoeener: 1680.60569901 hartree
cpcmener: -0.03887855 hartree
kineticenergy: 1383.08137235 hartree
xcener: -94.348065845565 hartree
chargesum: 0.0000000
charge: -0.124890 -0.107415 -0.487680 -0.500241 -0.239612 -0.238468 -0.243415 0.061914 -0.151227 -0.137117 -0.195642 -0.194800 0.312751 0.313692 0.091682 0.140242 0.130278 0.110497 0.108931 0.102396 0.079727 0.097738 0.098133 0.088226 0.104671 0.192219 0.200791 0.189835 0.196784
qa: -0.1249 -0.1074 -0.4877 -0.5002 -0.2396 -0.2385 -0.2434 0.0619 -0.1512 -0.1371 -0.1956 -0.1948 0.3128 0.3137 0.0917 0.1402 0.1303 0.1105 0.1089 0.1024 0.0797 0.0977 0.0981 0.0882 0.1047 0.1922 0.2008 0.1898 0.1968
va: 2.3191 2.3850 2.0097 2.0042 2.8946 3.2222 3.2098 3.9201 3.8930 3.9450 3.9452 3.9400 4.3409 4.3499 1.0225 1.0041 1.0273 1.0105 1.0375 0.9956 0.9951 0.9998 0.9974 0.9953 0.9960 1.0026 1.0004 1.0042 1.0035
dispcorr: -0.012794922 hartree
energy: -1387.033689053414
dipole: -11.27934 11.63935 0.36002 1.10627 -1.23194 -0.12568 -1.43576 0.93380 -0.50196
magnitude: 0.63037 au
magnitude: 1.60228 debye
