program: Orca
programVersion: 5.0.2
elementType: S S O O N N N C C C C C C C H H H H H H H H H H H H H H H
charge: 0
multiplicity: 1
keywords: wb97x-d3
keywords: def2-TZVPP
keywords: def2/J RIJCOSX
keywords: DEFGRID2
keywords: scfconv7
keywords: smallprint printgap noloewdin
keywords: NOSOSCF
formula: C7H15N3O2S2
InChI: InChI=1/C7H15N3O2S2/c1-10(2)5(3-13-6(8)11)4-14-7(9)12/h5H,3-4,8-9H2,1-2H3
29 atoms
S  0.923752 -1.794556 -1.062057
S  0.520124 2.727056 -0.175235
O  0.290723 -4.245551 -1.503991
O  1.714999 2.062378 2.108789
N  -2.045446 -0.447643 0.185033
N  -1.257653 -3.131891 -0.263879
N  2.907357 3.336199 0.671402
C  -0.806607 0.265779 -0.128033
C  0.415499 -0.58947 0.205857
C  -0.739951 1.645348 0.546802
C  -3.167858 -0.042796 -0.639721
C  -2.401395 -0.470885 1.594304
C  -0.118638 -3.244989 -0.943665
C  1.823679 2.654879 1.055276
H  -0.80971 0.429445 -1.208569
H  1.304151 0.038403 0.280217
H  0.320451 -1.088983 1.171323
H  -1.688033 2.169235 0.416897
H  -0.550701 1.577674 1.618804
H  -3.500317 0.988143 -0.460203
H  -4.017087 -0.699422 -0.445867
H  -2.910249 -0.137983 -1.694929
H  -1.556535 -0.785848 2.20747
H  -3.201239 -1.196104 1.751241
H  -2.755335 0.494459 1.976185
H  -1.651957 -2.19924 -0.062794
H  -1.872278 -3.932738 -0.246564
H  2.977848 3.798396 -0.220611
H  3.704486 3.387031 1.287266
elementType: S O N C H
totalener: -1387.02010331 hartree
nucrepener: 1192.88036304 hartree
electener: -2579.90046634 hartree
oneelecener: -4275.67806689 hartree
twoeener: 1695.77760055 hartree
cpcmener: -0.04214819 hartree
kineticenergy: 1383.08307221 hartree
xcener: -94.349233905081 hartree
chargesum: 0.0000000
charge: -0.103199 -0.125324 -0.497033 -0.480792 -0.202042 -0.292145 -0.234876 0.068471 -0.178890 -0.147201 -0.188590 -0.230956 0.296466 0.307293 0.068437 0.124025 0.132615 0.137990 0.125324 0.097611 0.104592 0.104696 0.118998 0.112296 0.099269 0.210495 0.177931 0.192632 0.201906
qa: -0.1032 -0.1253 -0.4970 -0.4808 -0.2020 -0.2921 -0.2349 0.0685 -0.1789 -0.1472 -0.1886 -0.2310 0.2965 0.3073 0.0684 0.1240 0.1326 0.1380 0.1253 0.0976 0.1046 0.1047 0.1190 0.1123 0.0993 0.2105 0.1779 0.1926 0.2019
va: 2.2964 2.3136 2.0024 2.0241 3.0480 3.1154 3.2265 3.8861 3.9210 3.8985 3.9161 3.9344 4.3889 4.3541 1.0271 1.0155 1.0167 1.0094 1.0325 0.9988 0.9938 0.9979 0.9922 0.9945 0.9962 1.0698 1.0133 1.0028 0.9996
dispcorr: -0.014184521 hartree
energy: -1387.034287826317
dipole: -15.01168 13.44094 -1.57074 2.78142 0.28963 3.07105 5.72562 -4.92372 0.80190
magnitude: 3.54141 au
magnitude: 9.00156 debye
