program: Orca
programVersion: 5.0.2
elementType: S S O O N N N C C C C C C C H H H H H H H H H H H H H H H
charge: 0
multiplicity: 1
keywords: wb97x-d3
keywords: def2-TZVPP
keywords: def2/J RIJCOSX
keywords: DEFGRID2
keywords: scfconv7
keywords: smallprint printgap noloewdin
keywords: NOSOSCF
formula: C7H15N3O2S2
InChI: InChI=1/C7H15N3O2S2/c1-10(2)5(3-13-6(8)11)4-14-7(9)12/h5H,3-4,8-9H2,1-2H3
29 atoms
S  -0.166694 -2.745219 0.373076
S  1.564583 1.874855 0.45508
O  0.47434 -2.883789 -2.200972
O  -0.259449 3.780781 0.073677
N  -1.444047 0.110634 0.232923
N  -0.680313 -4.634343 -1.352316
N  1.198546 4.089842 1.773677
C  -0.236573 -0.097777 -0.520757
C  0.662717 -1.166928 0.093615
C  0.596898 1.142736 -0.892185
C  -2.485854 0.793614 -0.489842
C  -1.359039 0.546197 1.604783
C  -0.074203 -3.428809 -1.276276
C  0.676951 3.407712 0.731512
H  -0.5556 -0.49418 -1.491033
H  1.522309 -1.344367 -0.552908
H  1.053553 -0.863739 1.06627
H  1.311578 0.873739 -1.671437
H  -0.038233 1.932635 -1.295878
H  -2.594673 0.36486 -1.487616
H  -2.324206 1.875457 -0.597958
H  -3.438573 0.657075 0.026367
H  -1.204134 1.624454 1.732249
H  -0.561017 0.031242 2.137031
H  -2.292948 0.293607 2.1130
H  -1.206078 -5.01778 -0.588321
H  -0.734856 -5.090553 -2.245766
H  2.013556 3.774663 2.267012
H  0.839376 5.00535 1.979555
totalener: -1386.99003690 hartree
nucrepener: 1196.28472490 hartree
electener: -2583.27476180 hartree
oneelecener: -4283.53692586 hartree
twoeener: 1700.26216407 hartree
kineticenergy: 1383.16713684 hartree
xcener: -94.357755410029 hartree
chargesum: -0.0000000
charge: -0.100343 -0.122917 -0.395849 -0.378792 -0.194432 -0.253048 -0.248437 0.070163 -0.173148 -0.207263 -0.186576 -0.220014 0.306986 0.303536 0.095353 0.133255 0.124674 0.132086 0.132688 0.082739 0.091696 0.083728 0.090708 0.087254 0.101247 0.153918 0.166366 0.154666 0.169755
qa: -0.1003 -0.1229 -0.3958 -0.3788 -0.1944 -0.2530 -0.2484 0.0702 -0.1731 -0.2073 -0.1866 -0.2200 0.3070 0.3035 0.0954 0.1333 0.1247 0.1321 0.1327 0.0827 0.0917 0.0837 0.0907 0.0873 0.1012 0.1539 0.1664 0.1547 0.1698
va: 2.3319 2.2955 2.1128 2.1284 2.9052 3.1799 3.1707 3.8874 3.9092 3.9101 3.9542 3.9845 4.3349 4.3262 1.0117 1.0333 1.0165 1.0123 1.0282 1.0009 1.0005 0.9962 0.9835 0.9967 0.9966 1.0286 1.0248 1.0279 1.0221
dispcorr: -0.013862573 hartree
energy: -1387.003899474255
dipole: -7.76593 7.79520 0.02928 3.52964 -3.76226 -0.23262 1.60324 -0.68016 0.92308
magnitude: 0.95239 au
magnitude: 2.42078 debye
