program: Orca
programVersion: 5.0.2
elementType: S S O O N N N C C C C C C C H H H H H H H H H H H H H H H
charge: 0
multiplicity: 1
keywords: wb97x-d3
keywords: def2-TZVPP
keywords: def2/J RIJCOSX
keywords: DEFGRID2
keywords: scfconv7
keywords: smallprint printgap noloewdin
keywords: NOSOSCF
formula: C7H15N3O2S2
InChI: InChI=1/C7H15N3O2S2/c1-10(2)5(3-13-6(8)11)4-14-7(9)12/h5H,3-4,8-9H2,1-2H3
29 atoms
S  0.837785 -2.580369 -0.661945
S  -0.102218 2.648343 1.048669
O  -1.431361 -3.340312 0.509431
O  2.365445 2.549833 0.072616
N  -1.06455 -0.134783 -0.35476
N  -1.098072 -4.033586 -1.619274
N  1.257344 4.50652 -0.181611
C  0.249234 -0.020127 0.228061
C  0.769204 -1.389601 0.688581
C  0.384607 0.945276 1.411935
C  -2.180449 -0.171822 0.55285
C  -1.321119 0.629766 -1.548354
C  -0.768231 -3.357287 -0.494621
C  1.382101 3.226666 0.231645
H  0.92697 0.329468 -0.553222
H  1.787441 -1.302369 1.071242
H  0.157292 -1.819766 1.48368
H  -0.249313 0.641185 2.247137
H  1.411893 0.960633 1.776912
H  -1.988001 -0.850464 1.383165
H  -3.057319 -0.564753 0.03548
H  -2.457838 0.811099 0.964429
H  -0.465496 0.56757 -2.221269
H  -1.536958 1.692002 -1.372768
H  -2.177285 0.201147 -2.075776
H  -0.633921 -3.850561 -2.490296
H  -1.987223 -4.501528 -1.647512
H  0.44266 5.058882 0.014038
H  2.047871 4.954644 -0.61058
totalener: -1386.99139310 hartree
nucrepener: 1203.63067686 hartree
electener: -2590.62206996 hartree
oneelecener: -4298.29190506 hartree
twoeener: 1707.66983510 hartree
kineticenergy: 1383.16609150 hartree
xcener: -94.355642596546 hartree
chargesum: 0.0000000
charge: -0.115268 -0.123127 -0.389544 -0.386515 -0.217403 -0.250640 -0.250467 -0.000939 -0.129990 -0.149424 -0.197059 -0.167753 0.314440 0.310950 0.089894 0.124478 0.112540 0.131891 0.125873 0.103018 0.094749 0.080457 0.083773 0.078519 0.086948 0.154284 0.162711 0.154768 0.168836
qa: -0.1153 -0.1231 -0.3895 -0.3865 -0.2174 -0.2506 -0.2505 -0.0009 -0.1300 -0.1494 -0.1971 -0.1678 0.3144 0.3110 0.0899 0.1245 0.1125 0.1319 0.1259 0.1030 0.0947 0.0805 0.0838 0.0785 0.0869 0.1543 0.1627 0.1548 0.1688
va: 2.3059 2.3027 2.1250 2.1234 2.8782 3.1592 3.1791 3.9907 3.8816 3.8838 3.9446 3.9282 4.3288 4.3190 1.0230 1.0165 1.0375 1.0056 1.0340 1.0027 1.0015 0.9954 1.0042 1.0040 0.9972 1.0310 1.0262 1.0278 1.0232
dispcorr: -0.014286160 hartree
energy: -1387.005679256707
dipole: -7.32099 6.84612 -0.47487 2.46966 -1.44069 1.02897 -2.02614 1.15972 -0.86642
magnitude: 1.42652 au
magnitude: 3.62593 debye
