program: Orca
programVersion: 5.0.2
elementType: S S O O N N N C C C C C C C H H H H H H H H H H H H H H H
charge: 0
multiplicity: 1
keywords: wb97x-d3
keywords: def2-TZVPP
keywords: def2/J RIJCOSX
keywords: DEFGRID2
keywords: scfconv7
keywords: smallprint printgap noloewdin
keywords: NOSOSCF
formula: C7H15N3O2S2
InChI: InChI=1/C7H15N3O2S2/c1-10(2)5(3-13-6(8)11)4-14-7(9)12/h5H,3-4,8-9H2,1-2H3
29 atoms
S  -0.001698 -2.347474 0.998058
S  0.125786 2.51886 0.729414
O  0.331904 -2.492056 -1.632004
O  2.249284 0.968607 0.334906
N  -1.994843 0.774437 -0.784663
N  2.055408 -3.224067 -0.351343
N  2.502476 3.170833 -0.121165
C  -0.966509 0.07932 -0.04057
C  -1.373165 -1.342421 0.380363
C  -0.505484 0.886347 1.168552
C  -3.293185 0.850997 -0.164094
C  -2.075112 0.394002 -2.173298
C  0.832322 -2.682117 -0.554088
C  1.800511 2.086024 0.279742
H  -0.108651 -0.009956 -0.709103
H  -2.09982 -1.325701 1.196151
H  -1.83105 -1.875154 -0.453514
H  -1.320786 1.068184 1.871786
H  0.27344 0.350601 1.710053
H  -3.217009 1.195167 0.868024
H  -3.854412 -0.096243 -0.160102
H  -3.904368 1.583714 -0.693782
H  -1.085288 0.425631 -2.627651
H  -2.708447 1.103689 -2.708911
H  -2.486311 -0.611457 -2.349374
H  2.522013 -3.108252 0.530593
H  2.637664 -3.36424 -1.159732
H  2.071838 4.068165 -0.250438
H  3.436063 3.037856 -0.468055
totalener: -1386.99294818 hartree
nucrepener: 1212.37140901 hartree
electener: -2599.36435720 hartree
oneelecener: -4315.89808716 hartree
twoeener: 1716.53372996 hartree
kineticenergy: 1383.16116607 hartree
xcener: -94.352244781967 hartree
chargesum: -0.0000000
charge: -0.114501 -0.101156 -0.382950 -0.396637 -0.218232 -0.248880 -0.252501 0.027652 -0.160135 -0.143741 -0.197088 -0.159720 0.313735 0.303836 0.095792 0.118409 0.127361 0.116373 0.125424 0.087186 0.076103 0.097577 0.089952 0.085470 0.072108 0.157134 0.163527 0.153050 0.164852
qa: -0.1145 -0.1012 -0.3829 -0.3966 -0.2182 -0.2489 -0.2525 0.0277 -0.1601 -0.1437 -0.1971 -0.1597 0.3137 0.3038 0.0958 0.1184 0.1274 0.1164 0.1254 0.0872 0.0761 0.0976 0.0900 0.0855 0.0721 0.1571 0.1635 0.1531 0.1649
va: 2.3217 2.3317 2.1249 2.1067 2.9224 3.1793 3.1755 3.9141 3.9552 3.8876 3.9685 3.9619 4.3194 4.3322 1.0229 1.0036 1.0274 1.0144 1.0509 0.9964 0.9923 0.9995 1.0053 0.9919 0.9984 1.0280 1.0272 1.0287 1.0258
dispcorr: -0.013830123 hartree
energy: -1387.006778307618
dipole: -11.04550 11.55141 0.50590 2.44801 -1.77010 0.67792 -5.04661 5.18513 0.13852
magnitude: 0.85714 au
magnitude: 2.17869 debye
