program: Orca
programVersion: 5.0.2
elementType: S S O O N N N C C C C C C C H H H H H H H H H H H H H H H
charge: 0
multiplicity: 1
keywords: wb97x-d3
keywords: def2-TZVPP
keywords: def2/J RIJCOSX
keywords: DEFGRID2
keywords: scfconv7
keywords: smallprint printgap noloewdin
keywords: NOSOSCF
formula: C7H15N3O2S2
InChI: InChI=1/C7H15N3O2S2/c1-10(2)5(3-13-6(8)11)4-14-7(9)12/h5H,3-4,8-9H2,1-2H3
29 atoms
S  0.120969 -2.375757 0.860561
S  0.17301 2.474182 0.805439
O  0.209347 -2.381889 -1.791576
O  2.265176 0.932923 0.240936
N  -2.102827 0.776338 -0.556658
N  2.082522 -3.076236 -0.715401
N  2.503874 3.148397 -0.151586
C  -0.992724 0.069822 0.046039
C  -1.326954 -1.380908 0.428927
C  -0.43149 0.830081 1.242535
C  -2.295782 0.48377 -1.955653
C  -3.342226 0.760604 0.17881
C  0.820002 -2.593001 -0.776479
C  1.819542 2.053033 0.249837
H  -0.203337 0.034435 -0.706709
H  -1.971057 -1.425919 1.310495
H  -1.851364 -1.883053 -0.384453
H  -1.186405 0.989466 2.014988
H  0.387301 0.275287 1.69935
H  -2.684912 -0.524605 -2.161804
H  -1.353108 0.58648 -2.492087
H  -3.000015 1.199961 -2.383264
H  -3.876064 -0.201876 0.152343
H  -4.017196 1.513562 -0.231799
H  -3.182192 1.021278 1.225768
H  2.628634 -2.952721 0.118855
H  2.588684 -3.147085 -1.581943
H  2.075167 4.053615 -0.213909
H  3.417241 3.025806 -0.55165
totalener: -1386.99315541 hartree
nucrepener: 1213.74938732 hartree
electener: -2600.74254273 hartree
oneelecener: -4318.64333841 hartree
twoeener: 1717.90079568 hartree
kineticenergy: 1383.16409314 hartree
xcener: -94.352558949813 hartree
chargesum: -0.0000000
charge: -0.112853 -0.102421 -0.381695 -0.398109 -0.219487 -0.248341 -0.251896 0.025846 -0.159753 -0.137151 -0.159054 -0.197878 0.311762 0.303725 0.093004 0.118503 0.127159 0.115745 0.124520 0.073204 0.089188 0.085219 0.076349 0.098445 0.087130 0.158667 0.162205 0.153225 0.164744
qa: -0.1129 -0.1024 -0.3817 -0.3981 -0.2195 -0.2483 -0.2519 0.0258 -0.1598 -0.1372 -0.1591 -0.1979 0.3118 0.3037 0.0930 0.1185 0.1272 0.1157 0.1245 0.0732 0.0892 0.0852 0.0763 0.0984 0.0871 0.1587 0.1622 0.1532 0.1647
va: 2.3223 2.3316 2.1262 2.1048 2.9207 3.1783 3.1767 3.9207 3.9543 3.8839 3.9613 3.9679 4.3209 4.3312 1.0227 1.0034 1.0274 1.0162 1.0518 0.9987 1.0054 0.9919 0.9923 0.9995 0.9967 1.0277 1.0280 1.0285 1.0258
dispcorr: -0.013877348 hartree
energy: -1387.007032755967
dipole: -11.57403 12.11602 0.54198 2.55669 -1.82005 0.73664 -3.85228 3.97349 0.12121
magnitude: 0.92254 au
magnitude: 2.34490 debye
