program: Orca
programVersion: 5.0.2
elementType: S S O O N N N C C C C C C C H H H H H H H H H H H H H H H
charge: 0
multiplicity: 1
keywords: wb97x-d3
keywords: def2-TZVPP
keywords: def2/J RIJCOSX
keywords: DEFGRID2
keywords: scfconv7
keywords: smallprint printgap noloewdin
keywords: NOSOSCF
formula: C7H15N3O2S2
InChI: InChI=1/C7H15N3O2S2/c1-10(2)5(3-13-6(8)11)4-14-7(9)12/h5H,3-4,8-9H2,1-2H3
29 atoms
S  -0.52781 -2.464929 0.165089
S  0.938235 1.931251 1.339959
O  1.861153 -1.388996 -0.296852
O  0.915883 2.525341 -1.247788
N  -2.332629 0.108446 -0.362729
N  1.45834 -3.408233 -1.234656
N  2.931749 1.984889 -0.345097
C  -1.002122 0.270923 0.185009
C  -0.619372 -0.907533 1.073642
C  -0.791813 1.606263 0.918222
C  -2.543719 0.806583 -1.607221
C  -3.427685 0.293706 0.556339
C  1.128663 -2.327917 -0.492505
C  1.591246 2.177406 -0.315214
H  -0.320705 0.261089 -0.666975
H  0.344567 -0.735174 1.55017
H  -1.348895 -1.072287 1.868708
H  -1.161286 2.438957 0.319219
H  -1.322161 1.62928 1.873309
H  -1.736477 0.581684 -2.303471
H  -2.603438 1.901223 -1.512374
H  -3.476485 0.466819 -2.061206
H  -4.350258 -0.063252 0.095488
H  -3.600054 1.338381 0.857864
H  -3.283739 -0.293456 1.464208
H  0.80452 -4.144395 -1.429346
H  2.346193 -3.421545 -1.70444
H  3.338804 1.341595 0.312284
H  3.367069 2.018477 -1.252317
totalener: -1386.99303015 hartree
nucrepener: 1222.84314098 hartree
electener: -2609.83617113 hartree
oneelecener: -4336.76685810 hartree
twoeener: 1726.93068698 hartree
kineticenergy: 1383.16075423 hartree
xcener: -94.351578211648 hartree
chargesum: 0.0000000
charge: -0.102438 -0.111994 -0.410465 -0.374524 -0.218874 -0.249896 -0.242299 0.024297 -0.133392 -0.161651 -0.160137 -0.195531 0.310081 0.302817 0.088146 0.124336 0.117176 0.127066 0.117051 0.090222 0.072435 0.085596 0.097251 0.076365 0.086679 0.154648 0.164524 0.165305 0.157207
qa: -0.1024 -0.1120 -0.4105 -0.3745 -0.2189 -0.2499 -0.2423 0.0243 -0.1334 -0.1617 -0.1601 -0.1955 0.3101 0.3028 0.0881 0.1243 0.1172 0.1271 0.1171 0.0902 0.0724 0.0856 0.0973 0.0764 0.0867 0.1546 0.1645 0.1653 0.1572
va: 2.3315 2.3158 2.0944 2.1364 2.9265 3.1810 3.1751 3.9241 3.8728 3.9606 3.9609 3.9689 4.3237 4.3323 1.0244 1.0553 1.0175 1.0258 1.0022 1.0050 0.9983 0.9919 0.9992 0.9923 0.9967 1.0280 1.0259 1.0275 1.0310
dispcorr: -0.014353880 hartree
energy: -1387.007384024963
dipole: -12.46963 12.67241 0.20278 1.66114 -2.84027 -1.17913 -2.36043 2.20754 -0.15289
magnitude: 1.20617 au
magnitude: 3.06584 debye
