program: Orca
programVersion: 5.0.2
elementType: S S S S O O O O N C C C C C C C C C C C C C C C C C H H H H H H H H H H H H H H H H H H H H H
charge: 0
multiplicity: 1
keywords: wb97x-d3
keywords: def2-TZVPP
keywords: def2/J RIJCOSX
keywords: DEFGRID2
keywords: scfconv7
keywords: smallprint printgap noloewdin
keywords: NOSOSCF
formula: C17H21NO4S4
InChI: InChI=1/C17H21NO4S4/c1-18(2)15(13-23-25(19,20)16-9-5-3-6-10-16)14-24-26(21,22)17-11-7-4-8-12-17/h3-12,15H,13-14H2,1-2H3
47 atoms
S  1.386969 -2.156793 -1.30995
S  0.62688 1.021893 2.392937
S  -0.646477 -1.804536 -1.567184
S  0.130068 2.963226 1.778901
O  -0.89681 -2.231717 -2.934837
O  -0.961947 -0.445997 -1.150584
O  1.34851 3.724725 1.550187
O  -0.8272 3.387251 2.78789
N  3.345235 0.15935 -0.588041
C  2.115662 0.077818 0.174148
C  1.659496 -1.369648 0.305634
C  2.21945 0.723673 1.563925
C  4.537873 -0.302744 0.090576
C  3.545281 1.451208 -1.203662
C  -1.458324 -2.914016 -0.452884
C  -0.725663 2.807538 0.240479
C  -1.661651 -4.229304 -0.851329
C  -0.046301 3.054359 -0.943572
C  -1.864134 -2.454312 0.793175
C  -2.07415 2.475238 0.260407
C  -2.283519 -5.101006 0.026246
C  -0.741919 2.959374 -2.139186
C  -2.475459 -3.344325 1.663805
C  -2.754283 2.391348 -0.942617
C  -2.684913 -4.661419 1.281839
C  -2.090343 2.632592 -2.138458
H  1.357166 0.614928 -0.398464
H  2.411785 -1.98591 0.801729
H  0.758948 -1.463398 0.915603
H  2.760614 0.081506 2.264003
H  2.765271 1.667824 1.53195
H  4.390497 -1.292117 0.524713
H  4.892707 0.362756 0.890286
H  5.349814 -0.39563 -0.632838
H  3.720226 2.272762 -0.492426
H  2.6804 1.713351 -1.81467
H  4.411394 1.409249 -1.866876
H  -1.346923 -4.575336 -1.827153
H  1.001637 3.321208 -0.944961
H  -1.714676 -1.424598 1.09028
H  -2.593943 2.287239 1.19072
H  -2.457129 -6.125901 -0.273084
H  -0.227397 3.149497 -3.071542
H  -2.792597 -3.001831 2.639608
H  -3.806028 2.138967 -0.94418
H  -3.166063 -5.35004 1.96387
H  -2.628561 2.56585 -3.074735
elementType: S O N C H
totalener: -2608.99380037 hartree
nucrepener: 3316.61288043 hartree
electener: -5925.60668080 hartree
twoeener: 4261.54553434 hartree
cpcmener: -0.04254407 hartree
kineticenergy: 2601.47485370 hartree
xcener: -173.967042733706 hartree
chargesum: -0.0000000
charge: -0.103878 -0.120719 0.825950 0.825762 -0.518906 -0.504137 -0.502221 -0.513143 -0.252866 0.180942 -0.179593 -0.182796 -0.199771 -0.199329 0.007917 0.007555 -0.123978 -0.104587 -0.095200 -0.140756 -0.151223 -0.160458 -0.169927 -0.138119 -0.114607 -0.121036 0.023492 0.145510 0.125222 0.150456 0.149434 0.104223 0.085383 0.106327 0.083328 0.095854 0.106652 0.146866 0.166766 0.146126 0.144154 0.162763 0.159454 0.161319 0.161374 0.163548 0.160876
qa: -0.1039 -0.1207 0.8260 0.8258 -0.5189 -0.5041 -0.5022 -0.5131 -0.2529 0.1809 -0.1796 -0.1828 -0.1998 -0.1993 0.0079 0.0076 -0.1240 -0.1046 -0.0952 -0.1408 -0.1512 -0.1605 -0.1699 -0.1381 -0.1146 -0.1210 0.0235 0.1455 0.1252 0.1505 0.1494 0.1042 0.0854 0.1063 0.0833 0.0959 0.1067 0.1469 0.1668 0.1461 0.1442 0.1628 0.1595 0.1613 0.1614 0.1635 0.1609
va: 2.2762 2.2641 5.6135 5.6072 1.9681 1.9834 1.9694 1.9759 2.9325 3.8438 3.9218 3.9125 3.9429 3.9495 3.6301 3.6252 3.9839 3.8729 3.9045 3.9719 3.9253 3.9420 3.9534 3.9102 3.8945 3.8999 1.0593 1.0160 1.0270 0.9941 1.0141 0.9946 0.9929 0.9953 0.9962 0.9957 0.9966 1.0142 0.9962 1.0050 1.0142 0.9887 0.9919 0.9896 0.9876 0.9867 0.9871
dispcorr: -0.031953802 hartree
energy: -2609.025754169057
dipole: 14.38839 -13.84763 0.54076 -3.72244 1.10456 -2.61787 -1.85725 2.33452 0.47727
magnitude: 2.71541 au
magnitude: 6.90203 debye
