program: Orca
programVersion: 5.0.2
elementType: S S S S O O O O N C C C C C C C C C C C C C C C C C H H H H H H H H H H H H H H H H H H H H H
charge: 0
multiplicity: 1
keywords: wb97x-d3
keywords: def2-TZVPP
keywords: def2/J RIJCOSX
keywords: DEFGRID2
keywords: scfconv7
keywords: smallprint printgap noloewdin
keywords: NOSOSCF
formula: C17H21NO4S4
InChI: InChI=1/C17H21NO4S4/c1-18(2)15(13-23-25(19,20)16-9-5-3-6-10-16)14-24-26(21,22)17-11-7-4-8-12-17/h3-12,15H,13-14H2,1-2H3
47 atoms
S  -1.122942 -0.970564 1.438498
S  2.262576 2.622863 1.085458
S  -1.638334 -1.684125 -0.457665
S  1.467871 3.048274 -0.808979
O  -0.671548 -1.233083 -1.442966
O  -3.045762 -1.35832 -0.570266
O  1.677955 1.92641 -1.703569
O  2.005702 4.359885 -1.103644
N  2.882624 -0.413833 0.625136
C  1.490319 -0.092918 0.796769
C  0.679479 -1.233573 1.436651
C  1.277867 1.191221 1.597424
C  3.615925 -0.805597 1.799812
C  3.168127 -1.226795 -0.528878
C  -1.456555 -3.440384 -0.294227
C  -0.2742 3.175669 -0.495355
C  -0.369004 -4.073636 -0.875658
C  -0.751417 4.296625 0.171528
C  -2.419332 -4.145023 0.415976
C  -1.116829 2.153574 -0.902211
C  -0.24225 -5.447967 -0.730652
C  -2.105906 4.383804 0.438633
C  -2.279366 -5.514332 0.551214
C  -2.472099 2.249128 -0.617515
C  -1.191803 -6.164239 -0.019548
C  -2.962698 3.360382 0.048955
H  1.089194 0.068514 -0.202115
H  0.898309 -2.191111 0.957314
H  0.930023 -1.360687 2.493226
H  0.221869 1.467326 1.596848
H  1.555987 1.059244 2.647286
H  3.457891 -0.098141 2.614953
H  4.683927 -0.78968 1.578423
H  3.378993 -1.813197 2.176121
H  2.680149 -0.806222 -1.407102
H  2.858341 -2.280985 -0.434163
H  4.242405 -1.224818 -0.719072
H  0.359556 -3.509394 -1.441931
H  -0.076635 5.086367 0.473341
H  -3.265824 -3.633371 0.853853
H  -0.731285 1.298644 -1.439304
H  0.598687 -5.957565 -1.180831
H  -2.495952 5.252458 0.95158
H  -3.022547 -6.07751 1.09888
H  -3.135207 1.447909 -0.91396
H  -1.08871 -7.235646 0.088658
H  -4.019567 3.432107 0.269065
totalener: -2608.95814475 hartree
nucrepener: 3309.23563673 hartree
electener: -5918.19378147 hartree
twoeener: 4253.40612200 hartree
kineticenergy: 2601.54474255 hartree
xcener: -173.977415615443 hartree
chargesum: 0.0000000
charge: -0.099817 -0.084559 0.777154 0.803223 -0.465184 -0.460810 -0.447932 -0.454510 -0.198370 0.116034 -0.210705 -0.230711 -0.192267 -0.168057 0.032858 -0.039984 -0.153252 -0.087332 -0.105672 -0.166359 -0.117844 -0.129899 -0.123031 -0.136521 -0.102908 -0.102058 0.059106 0.132350 0.128631 0.138943 0.127487 0.086667 0.101523 0.073218 0.113127 0.047418 0.092953 0.166630 0.127798 0.129813 0.201866 0.136607 0.131083 0.135300 0.149271 0.135992 0.132732
qa: -0.0998 -0.0846 0.7772 0.8032 -0.4652 -0.4608 -0.4479 -0.4545 -0.1984 0.1160 -0.2107 -0.2307 -0.1923 -0.1681 0.0329 -0.0400 -0.1533 -0.0873 -0.1057 -0.1664 -0.1178 -0.1299 -0.1230 -0.1365 -0.1029 -0.1021 0.0591 0.1323 0.1286 0.1389 0.1275 0.0867 0.1015 0.0732 0.1131 0.0474 0.0930 0.1666 0.1278 0.1298 0.2019 0.1366 0.1311 0.1353 0.1493 0.1360 0.1327
va: 2.2679 2.2684 5.6088 5.6524 1.9941 2.0346 2.0239 2.0398 2.9164 3.8148 3.9941 4.0001 3.9640 3.9606 3.7666 3.7641 3.9434 4.0081 4.0279 3.9128 3.9667 3.9586 3.9629 3.9633 3.9599 3.9594 1.0399 1.0040 1.0070 1.0058 0.9987 0.9970 1.0006 0.9905 1.0028 0.9932 1.0001 1.0048 1.0240 1.0209 0.9907 0.9993 0.9990 0.9988 1.0103 0.9967 0.9974
dispcorr: -0.032974132 hartree
energy: -2608.991118880139
dipole: 8.94814 -9.66324 -0.71510 -16.60876 13.98001 -2.62875 8.62315 -6.60652 2.01663
magnitude: 3.38947 au
magnitude: 8.61535 debye
