program: Orca
programVersion: 5.0.2
elementType: Cl Cl F F F F O O N N C C C C C C C C C C C C C C H H H H H H
charge: 0
multiplicity: 1
keywords: wb97x-d3
keywords: def2-TZVPP
keywords: def2/J RIJCOSX
keywords: DEFGRID2
keywords: scfconv7
keywords: smallprint printgap noloewdin
keywords: NOSOSCF
formula: C14H6Cl2F4N2O2
InChI: InChI=1/C14H6Cl2F4N2O2/c15-5-4-8(12(20)10(16)11(5)19)21-14(24)22-13(23)9-6(17)2-1-3-7(9)18/h1-4,21-22H
30 atoms
Cl 4.546176 -0.532168 -2.469101
Cl 4.553462 0.414287 2.804418
F  1.66471 -0.603448 -2.119609
F  5.69183 -0.022519 0.163529
F  -4.00626 -0.733614 -2.033549
F  -4.368286 0.545195 2.441132
O  -2.181496 -0.974476 1.187466
O  -0.079651 1.539733 -1.325809
N  0.192743 -0.13339 0.181423
N  -1.931363 0.615936 -0.427513
C  1.592145 -0.089825 0.172236
C  -4.137328 -0.087275 0.20537
C  2.305136 -0.318288 -0.995717
C  2.292092 0.141716 1.347483
C  3.688316 -0.275827 -1.012283
C  3.675529 0.146887 1.352044
C  -2.660069 -0.206977 0.378047
C  -0.543627 0.719148 -0.564013
C  4.36826 -0.047199 0.171215
C  -4.768686 -0.378232 -0.995228
C  -4.951215 0.25078 1.27803
C  -6.138459 -0.335744 -1.14534
C  -6.324094 0.316567 1.175119
C  -6.908284 0.016983 -0.047043
H  1.744916 0.316337 2.264395
H  -0.273523 -0.705434 0.877564
H  -2.435075 1.271762 -1.011941
H  -6.592128 -0.578239 -2.096937
H  -6.922494 0.596949 2.031499
H  -7.984453 0.058084 -0.144705
elementType: Cl F O N C H
totalener: -2117.03338447 hartree
nucrepener: 2263.28393582 hartree
electener: -4380.31732029 hartree
oneelecener: -7415.20683422 hartree
twoeener: 3034.88951393 hartree
cpcmener: -0.03004172 hartree
kineticenergy: 2111.36517547 hartree
xcener: -147.932724609535 hartree
chargesum: -0.0000000
charge: -0.039117 -0.056388 -0.185288 -0.181485 -0.206107 -0.201709 -0.441719 -0.479750 -0.213625 -0.158430 0.085108 -0.137483 0.211453 -0.165744 -0.002226 0.036292 0.404464 0.417488 0.227965 0.306913 0.306213 -0.241173 -0.242778 -0.064594 0.141815 0.208314 0.199174 0.153450 0.152270 0.166695
qa: -0.0391 -0.0564 -0.1853 -0.1815 -0.2061 -0.2017 -0.4417 -0.4797 -0.2136 -0.1584 0.0851 -0.1375 0.2115 -0.1657 -0.0022 0.0363 0.4045 0.4175 0.2280 0.3069 0.3062 -0.2412 -0.2428 -0.0646 0.1418 0.2083 0.1992 0.1535 0.1523 0.1667
va: 1.2556 1.2390 1.1321 1.1378 1.0887 1.0978 2.0672 2.0425 3.1325 3.2014 3.7021 3.5405 4.1649 4.1101 3.8503 3.8758 4.0863 4.3417 4.1308 3.9362 3.9537 3.9624 3.9589 3.8117 1.0195 1.0324 1.0038 1.0003 1.0010 0.9848
dispcorr: -0.013691697 hartree
energy: -2117.047076168389
dipole: -32.39165 29.12039 -3.27126 1.81514 -1.81462 0.00051 2.77223 -2.19030 0.58193
magnitude: 3.32262 au
magnitude: 8.44542 debye
