program: Orca
programVersion: 5.0.2
elementType: Cl Cl F F F F O O N N C C C C C C C C C C C C C C H H H H H H
charge: 0
multiplicity: 1
keywords: wb97x-d3
keywords: def2-TZVPP
keywords: def2/J RIJCOSX
keywords: DEFGRID2
keywords: scfconv7
keywords: smallprint printgap noloewdin
keywords: NOSOSCF
formula: C14H6Cl2F4N2O2
InChI: InChI=1/C14H6Cl2F4N2O2/c15-5-4-8(12(20)10(16)11(5)19)21-14(24)22-13(23)9-6(17)2-1-3-7(9)18/h1-4,21-22H
30 atoms
Cl 4.323341 -2.666604 -0.605482
Cl 4.797351 2.539411 0.542367
F  1.484068 -2.089222 -0.507495
F  5.712213 -0.15793 -0.037566
F  -4.104379 1.560198 -1.681678
F  -4.198068 -1.742691 1.618204
O  -2.048414 -1.224879 -0.315732
O  -0.227283 2.348644 0.653395
N  0.213654 0.200663 0.012257
N  -1.965647 0.970816 0.280476
C  1.604727 0.1994 0.013769
C  -4.099114 -0.088557 -0.026613
C  2.232306 -1.015686 -0.257662
C  2.416283 1.30443 0.25905
C  3.605483 -1.150402 -0.276742
C  3.796018 1.175214 0.238372
C  -2.611135 -0.18337 -0.043406
C  -0.591939 1.237984 0.332044
C  4.392421 -0.040465 -0.023572
C  -4.80214 0.764158 -0.865992
C  -4.848828 -0.923215 0.79167
C  -6.179928 0.800854 -0.904065
C  -6.2268 -0.912813 0.799608
C  -6.883821 -0.044767 -0.060099
H  1.985903 2.269876 0.46625
H  -0.25646 -0.672331 -0.215997
H  -2.530041 1.766799 0.552227
H  -6.689714 1.472481 -1.581518
H  -6.77316 -1.569861 1.462749
H  -7.964974 -0.028937 -0.073428
elementType: Cl F O N C H
totalener: -2117.03464972 hartree
nucrepener: 2259.42611872 hartree
electener: -4376.46076844 hartree
oneelecener: -7407.12277717 hartree
twoeener: 3030.66200873 hartree
cpcmener: -0.02490999 hartree
kineticenergy: 2111.34976482 hartree
xcener: -147.934814724007 hartree
chargesum: -0.0000000
charge: -0.039079 -0.058313 -0.197749 -0.185149 -0.205942 -0.200904 -0.438239 -0.480451 -0.166482 -0.152321 0.053832 -0.131346 0.241011 -0.131691 -0.023289 0.016477 0.401035 0.426118 0.204137 0.309545 0.302989 -0.241943 -0.242155 -0.062780 0.148696 0.183866 0.197081 0.153633 0.152663 0.166748
qa: -0.0391 -0.0583 -0.1977 -0.1851 -0.2059 -0.2009 -0.4382 -0.4805 -0.1665 -0.1523 0.0538 -0.1313 0.2410 -0.1317 -0.0233 0.0165 0.4010 0.4261 0.2041 0.3095 0.3030 -0.2419 -0.2422 -0.0628 0.1487 0.1839 0.1971 0.1536 0.1527 0.1667
va: 1.2547 1.2404 1.1079 1.1324 1.0891 1.0989 2.0795 2.0326 3.2273 3.2214 3.9770 3.5504 3.9980 3.9545 3.8981 3.9176 4.0750 4.3120 4.1442 3.9345 3.9597 3.9623 3.9607 3.8113 1.0460 1.0747 1.0055 1.0003 1.0008 0.9849
dispcorr: -0.013479245 hartree
energy: -2117.048128963894
dipole: -32.11366 28.61871 -3.49495 5.48367 -5.12246 0.36121 1.22020 -1.16018 0.06002
magnitude: 3.51408 au
magnitude: 8.93208 debye
